{"text_format":"1","workbook":"xlsx","n_sheets":3,"sheets":["アレルギー献立表（小） ","対象者","アレルゲン"],"not_rendered":{"charts":0,"images":1,"macros":1,"external_links":0,"defined_names":1,"comments":0,"pivot_tables":0},"unopened":[],"bounds":{"document_bytes":16777216,"sheet_cells":100000,"rows_first":2000,"rows_last":500,"rows_between":2000,"halvings":0,"cell_chars":16384,"cell_head_chars":4096},"cells_cut":0,"cells_raw":0,"read":"whole","date_system":"1900"}

{"sheet":"アレルギー献立表（小） ","index":0,"n_rows":216,"n_cols":13,"rows_kept":216,"cut":false,"hidden":false,"merged":[[144,0,151,0],[167,0,187,0],[188,0,201,0],[79,0,90,0],[91,0,98,0],[99,0,102,0],[118,0,131,0],[132,0,143,0],[9,0,27,0],[28,0,43,0],[44,0,49,0],[50,0,53,0],[61,0,78,0],[202,0,210,0],[211,0,214,0],[163,5,163,6],[215,5,215,6],[152,0,159,0],[5,1,5,2],[5,3,5,4],[5,5,5,6],[5,7,5,8],[5,9,5,10]]}
[null,{"$f":"CONCATENATE(IFERROR(VLOOKUP($M$3,対象者!$A:$O,2,FALSE),\"\"),DBCS(IFERROR(VLOOKUP($M$3,対象者!$A:$O,3,FALSE),\"\")),IFERROR(IF($M$3=\"\",\"\",\"年\"),\"\"))","v":""},{"$f":"IFERROR(VLOOKUP($M$3,対象者!$A:$O,4,FALSE),\"\")","v":""},{"$f":"IFERROR(VLOOKUP($M$3,対象者!$A:$O,5,FALSE),\"\")","v":""},null,null,null,null,null,null,null," "]
[null,{"$f":"CONCATENATE(IFERROR(VLOOKUP($M$3,対象者!$A:$O,6,FALSE),\"\"),\" \",IFERROR(VLOOKUP($M$3,対象者!$A:$O,7,FALSE),\"\"))","v":" "},{"$f":"CONCATENATE(IFERROR(VLOOKUP($M$3,対象者!$A:$O,8,FALSE),\"\"),\" \",IFERROR(VLOOKUP($M$3,対象者!$A:$O,9,FALSE),\"\"))","v":" "},{"$f":"CONCATENATE(IFERROR(VLOOKUP($M$3,対象者!$A:$O,10,FALSE),\"\"),\" \",IFERROR(VLOOKUP($M$3,対象者!$A:$O,11,FALSE),\"\"))","v":" "},{"$f":"CONCATENATE(IFERROR(VLOOKUP($M$3,対象者!$A:$O,12,FALSE),\"\"),\" \",IFERROR(VLOOKUP($M$3,対象者!$A:$O,13,FALSE),\"\"))","v":" "},{"$f":"CONCATENATE(IFERROR(VLOOKUP($M$3,対象者!$A:$O,14,FALSE),\"\"),\" \",IFERROR(VLOOKUP($M$3,対象者!$A:$O,15,FALSE),\"\"))","v":" "},null,null,null,null,null," ","番号"]
["　","令和8年度　9月アレルギー献立表（通常献立、アレルギー給食献立）",null,null,null,null,null,null,null,null,"小学校－１"," "]
[null,"１　通常給食を食べている人（一部を無配膳対応としている人を含む）は、「通常給食」欄を確認してください。",null,null,null,null,null,null,null,null,null," "]
[null,"２　アレルギー給食（卵･乳･えび･かにを除去した給食）を食べている人は、「アレルギー給食」欄を確認してください。ただし、通常給食とアレルギー給食の献立内容が同じ場合は、アレルギー給食の欄は空欄としています。",null,null,null,null,null,null,null,null,null," "]
["日","2026-09-02",null,"2026-09-03",null,"2026-09-04",null,"2026-09-07",null,"2026-09-08",null," "]
["主食","玄米ごはん",null,"◎●⑦あいちの米粉パン",null,"ごはん",null,"麦ごはん",null,"◎●⑦ロールパン",null," "]
["牛乳","◎牛乳",null,"◎牛乳",null,"◎牛乳",null,"◎牛乳",null,"◎はっこう乳",null," "]
[null,"通常給食","アレルギー給食\n(卵･乳･えび･かに除去)","通常給食","アレルギー給食\n(卵･乳･えび･かに除去)","通常給食","アレルギー給食\n(卵･乳･えび･かに除去)","通常給食","アレルギー給食\n(卵･乳･えび･かに除去)","通常給食","アレルギー給食\n(卵･乳･えび･かに除去)"," "]
["食缶","【えがおの夏野菜\n             　カレー】",null,"【じゃがいもスープ】","【＊じゃがいもスープ】","【さわにわん】",null,"【じゃがいもだんご汁】",null,"【ABCスープ】",null," "]
[null,"　たまねぎ(40)",null,"　たまねぎ(40)","　たまねぎ(40)","⑩豚肉(20)",null,"　じゃがいもだんご(25)",null,"　じゃがいも(25)",null," "]
[null,"　じゃがいも(30)",null,"　じゃがいも(40)","　じゃがいも(40)","⑫ながいも(15)",null,"　たまねぎ(20)",null,"　たまねぎ(20)",null," "]
[null,"　トマト(20)",null,"　マッシュポテト(20)","　マッシュポテト(20)","　かまぼこ(10)",null,"⑧鶏肉(10)",null,"⑧鶏肉(10)",null," "]
[null,"　なす(15)",null,"　にんじん(10)","　にんじん(10)","　にんじん(10)",null,"　かまぼこ(10)",null,"　とうもろこし(10)",null," "]
[null,"⑩豚肉(15)",null,"⑧鶏肉(15)","⑧鶏肉(15)","　たけのこ(10)",null,"　にんじん(8)",null,"　ひよこ豆(10)",null," "]
[null,"　にんじん(10)",null,"　マッシュルーム(5)","　マッシュルーム(5)","　ごぼう(10)",null,"　ねぎ(8)",null,"　にんじん(10)",null," "]
[null,"　ピーマン(5)",null,"　パセリ(0.05)","　パセリ(0.05)","　小松菜(10)",null,"　しいたけ(1)",null,"●ABCパスタ(3)",null," "]
[null,"　しょうが(0.5)",null,"◎牛乳(30)","⑦豆乳(30)","●⑦しょうゆ(4)",null,"●⑦しょうゆ(4)",null,"⑦⑩洋風だしの素(2)",null," "]
[null,"　にんにく(0.2)",null,"◎生クリーム(3)","⑦⑩洋風だしの素(3)","　塩(0.3)",null,"　本みりん(1)",null,"　白ワイン(1)",null," "]
[null,"　カレールウ\n　　　　[えがお](11)",null,"⑦⑩洋風だしの素(2)","　塩(0.4)","　こしょう(0.02)",null,"　塩(0.3)",null,"●⑦しょうゆ(1)",null," "]
[null,"　ソース(2.5)",null,"◎バター(0.5)","　こしょう(0.03)","　だし",null,"　だし",null,"　塩(0.3)",null," "]
[null,"　トマトケチャップ(2)",null,"　塩(0.4)",null,"",null,"",null,"　こしょう(0.03)",null," "]
[null,"⑦⑩洋風だしの素(1.5)",null,"　こしょう(0.03)",null,"",null,"",null,"",null," "]
[null,"●⑦しょうゆ(0.7)",null,"",null,"",null,"",null,"",null," "]
[null,"　純カレー(0.3)",null,"",null,"",null,"",null,"",null," "]
[null,"　塩(0.1)",null,"",null,"",null,"",null,"",null," "]
[null,"　こしょう(0.02)",null,"",null,"",null,"",null,"",null," "]
[null,"",null,"",null,"",null,"",null,"",null," "]
["フライ缶","【ツナサラダ】",null,"【キャベツと\n　　ウインナーの\n　　　　　　ソテー】",null,"【ささみしそ梅肉\n　　　　　　フライ】",null,"【ピリ辛大豆】",null,"【ハンバーグの\n　　いちじくソース\n　　　　　　　がけ】",null," "]
[null,"　キャベツ(20)",null,"　キャベツ(35)",null,"　ささみしそ梅肉\n　　　　フライ(50)",null,"⑦大豆(25)",null,"　ハンバーグ(50)",null," "]
[null,"　きゅうり(20)",null,"⑩ポークウインナー(25)",null,"　米油(5)",null,"⑩豚肉(25)",null,"　いちじくピューレ(2.5)",null," "]
[null,"　まぐろ油漬け(13)",null,"　にんじん(5)",null,"",null,"　たまねぎ(25)",null,"●⑦しょうゆ(2)",null," "]
[null,"　とうもろこし(5)",null,"　米油(0.5)",null,"《ささみしそ梅肉\n　　　　　　フライ》",null,"　にんじん(5)",null,"　砂糖(1.2)",null," "]
[null,"　にんじん(3)",null,"　塩(0.2)",null,"⑧ささみ",null,"⑦枝豆(5)",null,"　レモン果汁(0.3)",null," "]
[null,"　砂糖(1)",null,"　こしょう(0.02)",null,"●パン粉",null,"　しょうが(0.3)",null,"　でん粉(0.3)",null," "]
[null,"　ワインビネガー(1)",null,"",null,"●小麦粉",null,"●⑦しょうゆ(2.5)",null,"",null," "]
[null,"●⑦しょうゆ(0.8)",null,"",null,"　梅肉",null,"　砂糖(0.6)",null,"《ハンバーグ》",null," "]
[null,"　オリーブ油(0.5)",null,"",null,"",null,"　酒(0.5)",null,"⑧鶏肉",null," "]
[null,"　塩(0.1)",null,"",null,"",null,"④ごま油(0.2)",null,"　たまねぎ",null," "]
[null,"　こしょう(0.02)",null,"",null,"",null,"⑦⑧⑩中華だしの素(0.2)",null,"⑩豚肉",null," "]
[null,"",null,"",null,"",null,"　一味唐辛子(0.05)",null,"　でん粉",null," "]
[null,null,null,null,null,null,null,"　にんにく(0.01)",null,"⑩調味料等",null," "]
[null,"",null,"",null,"",null,null,null,"",null," "]
[null,"",null,"",null,"",null,"",null,"",null," "]
["あえ物・果物","【冷凍みかん】",null,"",null,"【もやしのごまじょうゆ和え】",null,"",null,"",null," "]
[null,"　みかん(120)",null,"",null,"　もやし(25)",null,"",null,"",null," "]
[null,"",null,"",null,"④白ごま(0.5)",null,"",null,"",null," "]
[null,"",null,"",null,"●⑦しょうゆ(1.2)",null,"",null,"",null," "]
[null,"",null,"",null,"④ごま油(0.2)",null,"",null,"",null," "]
[null,"",null,"",null,"",null,"",null,"",null," "]
["その他","",null,"",null,"【いわしの干し小魚】",null,"【アセロラゼリー】",null,"",null," "]
[null,"",null,"",null,"　いわしの干し小魚(5)",null,"　アセロラゼリー(40)",null,"",null," "]
[null,"",null,"",null,"",null,"",null,"",null," "]
[null,"",null,"",null,"",null,"",null,"",null," "]
["　",null,null,null,null,null,null,null,null,null,"（　）内は純使用量　単位：グラム"," "]
["　",null,null,null,null,null,null,null,null,null,null," "]
["　",null,null,null,null,null,null,null,null,null,"小学校－２"," "]
["日","2026-09-09",null,"2026-09-10",null,"2026-09-11",null,"2026-09-14",null,"2026-09-15",null," "]
["主食","ごはん",null,"ごはん",null,"●中華めん",null,"麦ごはん",null,"◎●⑦ミルクロールパン",null," "]
["牛乳","◎牛乳",null,"◎牛乳",null,"◎牛乳",null,"◎牛乳",null,"◎牛乳",null," "]
[null,"通常給食","アレルギー給食\n(卵･乳･えび･かに除去)","通常給食","アレルギー給食\n(卵･乳･えび･かに除去)","通常給食","アレルギー給食\n(卵･乳･えび･かに除去)","通常給食","アレルギー給食\n(卵･乳･えび･かに除去)","通常給食","アレルギー給食\n(卵･乳･えび･かに除去)"," "]
["食缶","【高野豆腐の卵とじ】","【＊高野豆腐のうま煮】","【トッポギスープ】",null,"【しょうゆラーメンの汁】",null,"【スタミナ汁】",null,"【大豆とチキン\n　　　のトマト煮】",null," "]
[null,"○液卵(40)","　たまねぎ(40)","　たまねぎ(25)",null,"　もやし(15)",null,"⑦豆腐(20)",null,"　たまねぎ(40)",null," "]
[null,"　たまねぎ(30)","　じゃがいも(35)","　トッポギ(20)",null,"⑩豚肉(15)",null,"　じゃがいも(20)",null,"⑦大豆(35)",null," "]
[null,"　じゃがいも(25)","⑧鶏肉(30)","⑧鶏肉(20)",null,"　なると(10)",null,"　たまねぎ(20)",null,"　にんじん(20)",null," "]
[null,"⑧鶏肉(10)","　にんじん(10)","　にんじん(10)",null,"　とうもろこし(10)",null,"⑩豚肉(15)",null,"　じゃがいも(20)",null," "]
[null,"　にんじん(10)","　さやいんげん(5)","　ねぎ(5)",null,"　ねぎ(10)",null,"　にんじん(10)",null,"　トマト(20)",null," "]
[null,"　さやいんげん(5)","⑦高野豆腐(8)","　とうもろこし(5)",null,"　たけのこ(10)",null,"　ねぎ(5)",null,"⑧鶏肉(15)",null," "]
[null,"⑦高野豆腐(5)","●⑦しょうゆ(4)","　わかめ(0.3)",null,"　にんじん(10)",null,"⑦油揚げ(3)",null,"　セロリ(2)",null," "]
[null,"●⑦しょうゆ(4)","　砂糖(2)","⑧⑩中華ガラスープ\n　　　　　　の素(3.5)",null,"　わかめ(0.4)",null,"　にんにく(0.2)",null,"　にんにく(0.3)",null," "]
[null,"　砂糖(2)","　本みりん(1)","●⑦しょうゆ(1.2)",null,"⑧チキンブイヨン(30)",null,"⑦合わせみそ(9)",null,"　トマトジュース(20)",null," "]
[null,"　本みりん(1)","　塩(0.2)","　酒(1)",null,"●⑦しょうゆ(7.5)",null,"　だし",null,"　トマトケチャップ(7)",null," "]
[null,"　塩(0.2)","　でん粉(0.5)","　塩(0.1)",null,"⑦⑧⑩中華だしの素(1.5)",null,"",null,"　ソース(2)",null," "]
[null,"　だし","　だし","　こしょう(0.03)",null,"④ごま油(0.3)",null,"",null,"　砂糖(2)",null," "]
[null,"",null,"",null,"　塩(0.12)",null,"",null,"⑦⑩洋風だしの素(1)",null," "]
[null,"",null,"",null,"　こしょう(0.04)",null,"",null,"　赤ワイン(1)",null," "]
[null,"",null,"",null,"",null,"",null,"　塩(0.4)",null," "]
[null,"",null,"",null,"",null,"",null,"　こしょう(0.03)",null," "]
[null,"",null,"",null,"",null,"",null,"",null," "]
["フライ缶","【ちくわのいそべ揚げ】",null,"【キムタクごはんの具】",null,"【里芋コロッケ】",null,"【まぐろの甘辛煮】",null,"【コーンサラダ】",null," "]
[null,"　ちくわ(40)",null,"　キムチ(30)",null,"　里芋コロッケ(50)",null,"　まぐろ油漬け(45)",null,"　キャベツ(25)",null," "]
[null,"●小麦粉(3)",null,"⑩豚肉(30)",null,"　米油(5)",null,"　キャベツ(12)",null,"　とうもろこし(20)",null," "]
[null,"　でん粉(1)",null,"⑦枝豆(5)",null,"",null,"　しょうが(1)",null,"　まぐろ油漬け(10)",null," "]
[null,"　青のり粉(0.12)",null,"　つぼ漬(5)",null,"《里芋コロッケ》",null,"　砂糖(3)",null,"　にんじん(5)",null," "]
[null,"　米油(4.41)",null,"　本みりん(1)",null,"　里芋",null,"●⑦しょうゆ(1.5)",null,"●⑦しょうゆ(1.2)",null," "]
[null,"",null,"④ごま油(0.3)",null,"⑧鶏肉",null,"　本みりん(1)",null,"　砂糖(1)",null," "]
[null,"",null,"",null,"●パン粉",null,"　酒(1)",null,"　ワインビネガー(1)",null," "]
[null,"",null,null,null,"●小麦粉",null,"",null,"　サラダ油(0.5)",null," "]
[null,"",null,"",null,"⑦植物性たん白",null,"",null,"　塩(0.1)",null," "]
[null,"",null,"",null,"●⑦調味料等",null,"",null,"　こしょう(0.02)",null," "]
[null,"",null,"",null,"",null,"",null,"",null," "]
["あえ物・果物","【キャベツとにんじんのおかか和え】",null,"",null,"【きゅうりのナムル】",null,"【きざみたくあん】",null,"",null," "]
[null,"　キャベツ(20)",null,"",null,"　きゅうり(30)",null,"　たくあん漬け(13)",null,"",null," "]
[null,"　にんじん(5)",null,"",null,"④白ごま(1)",null,"",null,"",null," "]
[null,"　花かつお(0.2)",null,"",null,"●⑦しょうゆ(1)",null,"《たくあん漬け》",null,"",null," "]
[null,"●⑦しょうゆ(1)",null,"",null,"　砂糖(0.5)",null,"　大根",null,"",null," "]
[null,"　砂糖(0.3)",null,"",null,"　米酢(0.5)",null,"●⑦調味料等",null,"",null," "]
[null,"",null,"",null,"④ごま油(0.3)",null,"",null,"",null," "]
[null,"",null,"",null,"",null,"",null,"",null," "]
["その他","",null,"【バナナチップス】",null,"",null,"【手巻きのり】",null,"",null," "]
[null,"",null,"⑨バナナチップス(10)",null,"",null,"　のり(2.5)",null,"",null," "]
[null,"",null,"",null,"",null,"",null,"",null," "]
[null,"",null,"",null,"",null,"",null,"",null," "]
["　",null,null,null,null,null,null,null,null,null,"（　）内は純使用量　単位：グラム"," "]
["※","アレルギー物質の19品目について、次のように表示しています。",null,null,null,null,null,null,null,null,null," "]
["　","○…卵","◎…乳","●…小麦","△…えび","▲…かに",null,"※　春日井市食育推進給食会ホームページに、当市が表示するアレルゲン19品目",null,null,null," "]
["　","①…いか","②…オレンジ","③…牛肉","④…ごま","⑤…さけ",null,"　 のアレルギーマークを検索して強調表示する機能を持つ「マーク強調機能付",null,null,null," "]
["　","⑥…さば","⑦…大豆","⑧…鶏肉","⑨…バナナ","⑩…豚肉",null,"　 アレルギー献立表」を掲載しています。",null,null,null," "]
["　","⑪…もも","⑫…やまいも","⑬…りんご","⑭…ゼラチン",null,null,"　　　https://www.kasugai-kyushoku.com/kondatehyou/allergy_mark/",null,null,null," "]
[null,"１　パンに表示される⑦大豆については、油、乳化剤（大豆由来）のアレルゲンを示します。",null,null,null,null,null,null,null,null,null," "]
[null,"２　アレルギー献立表の見方については、「保存版ＮＯ．１」を参照してください。",null,null,null,null,null,null,null,null,null," "]
[null,"３　「むろ削り」または「和風だしの素」については、「だし」と表記しています。",null,null,null,null,null,null,null,null,null," "]
["　",null,null,null,null,null,null,null,null,null,null," "]
["　",null,null,null,null,null,null,null,null,null,"小学校－３"," "]
["日","2026-09-16",null,"2026-09-17",null,"2026-09-18",null,"2026-09-24",null,"2026-09-25",null," "]
["主食","麦ごはん",null,"麦ごはん",null,"ごはん",null,"麦ごはん",null,"ごはん",null," "]
["牛乳","◎牛乳",null,"◎牛乳",null,"◎牛乳",null,"◎牛乳",null,"◎牛乳",null," "]
[null,"通常給食","アレルギー給食\n(卵･乳･えび･かに除去)","通常給食","アレルギー給食\n(卵･乳･えび･かに除去)","通常給食","アレルギー給食\n(卵･乳･えび･かに除去)","通常給食","アレルギー給食\n(卵･乳･えび･かに除去)","通常給食","アレルギー給食\n(卵･乳･えび･かに除去)"," "]
["食缶","【けんちん汁】",null,"【とうがんの\n　　　カレースープ】",null,"【さつまいも汁】",null,"【豚丼の具】",null,"【里芋の煮物】",null," "]
[null,"⑦豆腐(25)",null,"　とうがん(30)",null,"　さつまいも(25)",null,"　たまねぎ(65)",null,"　さといも(35)",null," "]
{"$rows_left_out":97}
{"sheet":"対象者","index":1,"n_rows":101,"n_cols":21,"rows_kept":101,"cut":false,"hidden":true,"merged":[]}
["番号","学校","学年","組","氏名","アレ１","１記号","アレ２","２記号","アレ３","３記号","アレ４","４記号","アレ５","５記号","アレ６","６記号","アレ７","７記号",1,"アレルゲンはドロップダウンリストから選択してください。"]
[1,null,null,null,null,null,"---",null,"---",null,"---",null,"---",null,"---",null,"---",null,"---",2,"アレルギー献立表に表示可能なアレルゲンは５種類までとなります。※６、７は参考入力"]
[2,null,null,null,null,null,"---",null,"---",null,"---",null,"---",null,"---",null,"---",null,"---","※","５種類を超えるアレルゲンのある場合は、弁当持参を促すべき児童生徒と言えます。"]
[3,null,null,null,null,null,"---",null,"---",null,"---",null,"---",null,"---",null,"---",null,"---",3,"このリストをアレルギー献立表の「対象者」シートにコピーして「値のみ」を貼り付けてください。"]
[4,null,null,null,null,null,"---",null,"---",null,"---",null,"---",null,"---",null,"---",null,"---",4,"対象者を100人以上登録したいときは、A100～R101を選択してコピー（又はオートフィル）してください。"]
[5,null,null,null,null,null,"---",null,"---",null,"---",null,"---",null,"---",null,"---",null,"---"]
[6,null,null,null,null,null,"---",null,"---",null,"---",null,"---",null,"---",null,"---",null,"---"]
[7,null,null,null,null,null,"---",null,"---",null,"---",null,"---",null,"---",null,"---",null,"---"]
[8,null,null,null,null,null,"---",null,"---",null,"---",null,"---",null,"---",null,"---",null,"---"]
[9,null,null,null,null,null,"---",null,"---",null,"---",null,"---",null,"---",null,"---",null,"---"]
[10,null,null,null,null,null,"---",null,"---",null,"---",null,"---",null,"---",null,"---",null,"---"]
[11,null,null,null,null,null,"---",null,"---",null,"---",null,"---",null,"---",null,"---",null,"---"]
[12,null,null,null,null,null,"---",null,"---",null,"---",null,"---",null,"---",null,"---",null,"---"]
[13,null,null,null,null,null,"---",null,"---",null,"---",null,"---",null,"---",null,"---",null,"---"]
[14,null,null,null,null,null,"---",null,"---",null,"---",null,"---",null,"---",null,"---",null,"---"]
[15,null,null,null,null,null,"---",null,"---",null,"---",null,"---",null,"---",null,"---",null,"---"]
[16,null,null,null,null,null,"---",null,"---",null,"---",null,"---",null,"---",null,"---",null,"---"]
[17,null,null,null,null,null,"---",null,"---",null,"---",null,"---",null,"---",null,"---",null,"---"]
[18,null,null,null,null,null,"---",null,"---",null,"---",null,"---",null,"---",null,"---",null,"---"]
[19,null,null,null,null,null,"---",null,"---",null,"---",null,"---",null,"---",null,"---",null,"---"]
[20,null,null,null,null,null,"---",null,"---",null,"---",null,"---",null,"---",null,"---",null,"---"]
[21,null,null,null,null,null,"---",null,"---",null,"---",null,"---",null,"---",null,"---",null,"---"]
[22,null,null,null,null,null,"---",null,"---",null,"---",null,"---",null,"---",null,"---",null,"---"]
[23,null,null,null,null,null,"---",null,"---",null,"---",null,"---",null,"---",null,"---",null,"---"]
[24,null,null,null,null,null,"---",null,"---",null,"---",null,"---",null,"---",null,"---",null,"---"]
[25,null,null,null,null,null,"---",null,"---",null,"---",null,"---",null,"---",null,"---",null,"---"]
[26,null,null,null,null,null,"---",null,"---",null,"---",null,"---",null,"---",null,"---",null,"---"]
[27,null,null,null,null,null,"---",null,"---",null,"---",null,"---",null,"---",null,"---",null,"---"]
[28,null,null,null,null,null,"---",null,"---",null,"---",null,"---",null,"---",null,"---",null,"---"]
[29,null,null,null,null,null,"---",null,"---",null,"---",null,"---",null,"---",null,"---",null,"---"]
[30,null,null,null,null,null,"---",null,"---",null,"---",null,"---",null,"---",null,"---",null,"---"]
[31,null,null,null,null,null,"---",null,"---",null,"---",null,"---",null,"---",null,"---",null,"---"]
[32,null,null,null,null,null,"---",null,"---",null,"---",null,"---",null,"---",null,"---",null,"---"]
[33,null,null,null,null,null,"---",null,"---",null,"---",null,"---",null,"---",null,"---",null,"---"]
[34,null,null,null,null,null,"---",null,"---",null,"---",null,"---",null,"---",null,"---",null,"---"]
[35,null,null,null,null,null,"---",null,"---",null,"---",null,"---",null,"---",null,"---",null,"---"]
[36,null,null,null,null,null,"---",null,"---",null,"---",null,"---",null,"---",null,"---",null,"---"]
[37,null,null,null,null,null,"---",null,"---",null,"---",null,"---",null,"---",null,"---",null,"---"]
[38,null,null,null,null,null,"---",null,"---",null,"---",null,"---",null,"---",null,"---",null,"---"]
[39,null,null,null,null,null,"---",null,"---",null,"---",null,"---",null,"---",null,"---",null,"---"]
[40,null,null,null,null,null,"---",null,"---",null,"---",null,"---",null,"---",null,"---",null,"---"]
[41,null,null,null,null,null,"---",null,"---",null,"---",null,"---",null,"---",null,"---",null,"---"]
[42,null,null,null,null,null,"---",null,"---",null,"---",null,"---",null,"---",null,"---",null,"---"]
[43,null,null,null,null,null,"---",null,"---",null,"---",null,"---",null,"---",null,"---",null,"---"]
[44,null,null,null,null,null,"---",null,"---",null,"---",null,"---",null,"---",null,"---",null,"---"]
[45,null,null,null,null,null,"---",null,"---",null,"---",null,"---",null,"---",null,"---",null,"---"]
[46,null,null,null,null,null,"---",null,"---",null,"---",null,"---",null,"---",null,"---",null,"---"]
[47,null,null,null,null,null,"---",null,"---",null,"---",null,"---",null,"---",null,"---",null,"---"]
[48,null,null,null,null,null,"---",null,"---",null,"---",null,"---",null,"---",null,"---",null,"---"]
[49,null,null,null,null,null,"---",null,"---",null,"---",null,"---",null,"---",null,"---",null,"---"]
[50,null,null,null,null,null,"---",null,"---",null,"---",null,"---",null,"---",null,"---",null,"---"]
[51,null,null,null,null,null,"---",null,"---",null,"---",null,"---",null,"---",null,"---",null,"---"]
[52,null,null,null,null,null,"---",null,"---",null,"---",null,"---",null,"---",null,"---",null,"---"]
[53,null,null,null,null,null,"---",null,"---",null,"---",null,"---",null,"---",null,"---",null,"---"]
[54,null,null,null,null,null,"---",null,"---",null,"---",null,"---",null,"---",null,"---",null,"---"]
[55,null,null,null,null,null,"---",null,"---",null,"---",null,"---",null,"---",null,"---",null,"---"]
[56,null,null,null,null,null,"---",null,"---",null,"---",null,"---",null,"---",null,"---",null,"---"]
[57,null,null,null,null,null,"---",null,"---",null,"---",null,"---",null,"---",null,"---",null,"---"]
[58,null,null,null,null,null,"---",null,"---",null,"---",null,"---",null,"---",null,"---",null,"---"]
[59,null,null,null,null,null,"---",null,"---",null,"---",null,"---",null,"---",null,"---",null,"---"]
[60,null,null,null,null,null,"---",null,"---",null,"---",null,"---",null,"---",null,"---",null,"---"]
[61,null,null,null,null,null,"---",null,"---",null,"---",null,"---",null,"---",null,"---",null,"---"]
[62,null,null,null,null,null,"---",null,"---",null,"---",null,"---",null,"---",null,"---",null,"---"]
[63,null,null,null,null,null,"---",null,"---",null,"---",null,"---",null,"---",null,"---",null,"---"]
[64,null,null,null,null,null,"---",null,"---",null,"---",null,"---",null,"---",null,"---",null,"---"]
[65,null,null,null,null,null,"---",null,"---",null,"---",null,"---",null,"---",null,"---",null,"---"]
[66,null,null,null,null,null,"---",null,"---",null,"---",null,"---",null,"---",null,"---",null,"---"]
[67,null,null,null,null,null,"---",null,"---",null,"---",null,"---",null,"---",null,"---",null,"---"]
[68,null,null,null,null,null,"---",null,"---",null,"---",null,"---",null,"---",null,"---",null,"---"]
[69,null,null,null,null,null,"---",null,"---",null,"---",null,"---",null,"---",null,"---",null,"---"]
[70,null,null,null,null,null,"---",null,"---",null,"---",null,"---",null,"---",null,"---",null,"---"]
[71,null,null,null,null,null,"---",null,"---",null,"---",null,"---",null,"---",null,"---",null,"---"]
[72,null,null,null,null,null,"---",null,"---",null,"---",null,"---",null,"---",null,"---",null,"---"]
[73,null,null,null,null,null,"---",null,"---",null,"---",null,"---",null,"---",null,"---",null,"---"]
[74,null,null,null,null,null,"---",null,"---",null,"---",null,"---",null,"---",null,"---",null,"---"]
[75,null,null,null,null,null,"---",null,"---",null,"---",null,"---",null,"---",null,"---",null,"---"]
[76,null,null,null,null,null,"---",null,"---",null,"---",null,"---",null,"---",null,"---",null,"---"]
[77,null,null,null,null,null,"---",null,"---",null,"---",null,"---",null,"---",null,"---",null,"---"]
[78,null,null,null,null,null,"---",null,"---",null,"---",null,"---",null,"---",null,"---",null,"---"]
[79,null,null,null,null,null,"---",null,"---",null,"---",null,"---",null,"---",null,"---",null,"---"]
[80,null,null,null,null,null,"---",null,"---",null,"---",null,"---",null,"---",null,"---",null,"---"]
[81,null,null,null,null,null,"---",null,"---",null,"---",null,"---",null,"---",null,"---",null,"---"]
[82,null,null,null,null,null,"---",null,"---",null,"---",null,"---",null,"---",null,"---",null,"---"]
[83,null,null,null,null,null,"---",null,"---",null,"---",null,"---",null,"---",null,"---",null,"---"]
[84,null,null,null,null,null,"---",null,"---",null,"---",null,"---",null,"---",null,"---",null,"---"]
[85,null,null,null,null,null,"---",null,"---",null,"---",null,"---",null,"---",null,"---",null,"---"]
[86,null,null,null,null,null,"---",null,"---",null,"---",null,"---",null,"---",null,"---",null,"---"]
[87,null,null,null,null,null,"---",null,"---",null,"---",null,"---",null,"---",null,"---",null,"---"]
[88,null,null,null,null,null,"---",null,"---",null,"---",null,"---",null,"---",null,"---",null,"---"]
[89,null,null,null,null,null,"---",null,"---",null,"---",null,"---",null,"---",null,"---",null,"---"]
[90,null,null,null,null,null,"---",null,"---",null,"---",null,"---",null,"---",null,"---",null,"---"]
[91,null,null,null,null,null,"---",null,"---",null,"---",null,"---",null,"---",null,"---",null,"---"]
[92,null,null,null,null,null,"---",null,"---",null,"---",null,"---",null,"---",null,"---",null,"---"]
[93,null,null,null,null,null,"---",null,"---",null,"---",null,"---",null,"---",null,"---",null,"---"]
[94,null,null,null,null,null,"---",null,"---",null,"---",null,"---",null,"---",null,"---",null,"---"]
[95,null,null,null,null,null,"---",null,"---",null,"---",null,"---",null,"---",null,"---",null,"---"]
[96,null,null,null,null,null,"---",null,"---",null,"---",null,"---",null,"---",null,"---",null,"---"]
[97,null,null,null,null,null,"---",null,"---",null,"---",null,"---",null,"---",null,"---",null,"---"]
[98,null,null,null,null,null,"---",null,"---",null,"---",null,"---",null,"---",null,"---",null,"---"]
[99,null,null,null,null,null,"---",null,"---",null,"---",null,"---",null,"---",null,"---",null,"---"]
[100,null,null,null,null,null,"---",null,"---",null,"---",null,"---",null,"---",null,"---",null,"---"]

{"sheet":"アレルゲン","index":2,"n_rows":5,"n_cols":4,"rows_kept":5,"cut":false,"hidden":true,"merged":[]}
[1,{"$f":"VLOOKUP(D$1,対象者!$A:$S,7,FALSE)","v":{"$error":"#N/A"}},"個人番号",{"$f":"'アレルギー献立表（小） '!M3","v":0}]
[2,{"$f":"VLOOKUP(D$1,対象者!$A:$S,9,FALSE)","v":{"$error":"#N/A"}}]
[3,{"$f":"VLOOKUP(D$1,対象者!$A:$S,11,FALSE)","v":{"$error":"#N/A"}}]
[4,{"$f":"VLOOKUP(D$1,対象者!$A:$S,13,FALSE)","v":{"$error":"#N/A"}}]
[5,{"$f":"VLOOKUP(D$1,対象者!$A:$S,15,FALSE)","v":{"$error":"#N/A"}}]