{"text_format":"1","workbook":"xlsx","n_sheets":3,"sheets":["アレルギー献立表（中）","対象者","アレルゲン"],"not_rendered":{"charts":0,"images":1,"macros":1,"external_links":0,"defined_names":1,"comments":0,"pivot_tables":0},"unopened":[],"bounds":{"document_bytes":16777216,"sheet_cells":100000,"rows_first":2000,"rows_last":500,"rows_between":2000,"halvings":0,"cell_chars":16384,"cell_head_chars":4096},"cells_cut":0,"cells_raw":0,"read":"whole","date_system":"1900"}

{"sheet":"アレルギー献立表（中）","index":0,"n_rows":214,"n_cols":13,"rows_kept":214,"cut":false,"hidden":false,"merged":[[82,0,93,0],[5,1,5,2],[167,0,187,0],[188,0,201,0],[202,0,210,0],[9,0,27,0],[28,0,42,0],[43,0,48,0],[49,0,56,0],[64,0,81,0],[211,0,212,0],[94,0,101,0],[102,0,105,0],[122,0,135,0],[136,0,147,0],[148,0,155,0],[156,0,159,0]]}
[null,{"$f":"CONCATENATE(IFERROR(VLOOKUP($M$3,対象者!$A:$O,2,FALSE),\"\"),DBCS(IFERROR(VLOOKUP($M$3,対象者!$A:$O,3,FALSE),\"\")),IFERROR(IF($M$3=\"\",\"\",\"年\"),\"\"))","v":""},{"$f":"IFERROR(VLOOKUP($M$3,対象者!$A:$O,4,FALSE),\"\")","v":""},{"$f":"IFERROR(VLOOKUP($M$3,対象者!$A:$O,5,FALSE),\"\")","v":""},null,null,null,null,null,null,null,"　"]
[null,{"$f":"CONCATENATE(IFERROR(VLOOKUP($M$3,対象者!$A:$O,6,FALSE),\"\"),\" \",IFERROR(VLOOKUP($M$3,対象者!$A:$O,7,FALSE),\"\"))","v":" "},{"$f":"CONCATENATE(IFERROR(VLOOKUP($M$3,対象者!$A:$O,8,FALSE),\"\"),\" \",IFERROR(VLOOKUP($M$3,対象者!$A:$O,9,FALSE),\"\"))","v":" "},{"$f":"CONCATENATE(IFERROR(VLOOKUP($M$3,対象者!$A:$O,10,FALSE),\"\"),\" \",IFERROR(VLOOKUP($M$3,対象者!$A:$O,11,FALSE),\"\"))","v":" "},{"$f":"CONCATENATE(IFERROR(VLOOKUP($M$3,対象者!$A:$O,12,FALSE),\"\"),\" \",IFERROR(VLOOKUP($M$3,対象者!$A:$O,13,FALSE),\"\"))","v":" "},{"$f":"CONCATENATE(IFERROR(VLOOKUP($M$3,対象者!$A:$O,14,FALSE),\"\"),\" \",IFERROR(VLOOKUP($M$3,対象者!$A:$O,15,FALSE),\"\"))","v":" "},null,null,null,null,null,"　","番号"]
["　","令和8年度　9月アレルギー献立表（通常献立、アレルギー給食献立）",null,null,null,null,null,null,null,null,"中学校－１","　"]
[null,"１　通常給食を食べている人（一部を無配膳対応としている人を含む）は、「通常給食」欄を確認してください。",null,null,null,null,null,null,null,null,null,"　"]
[null,"２　アレルギー給食（卵･乳･えび･かにを除去した給食）を食べている人は、「アレルギー給食」欄を確認してください。ただし、通常給食とアレルギー給食の献立内容が同じ場合は、アレルギー給食の欄は空欄としています。",null,null,null,null,null,null,null,null,null,"　"]
["日","2026-09-02",null,"2026-09-03",null,"2026-09-04",null,"2026-09-07",null,"2026-09-08",null,"　"]
["主食","玄米ごはん",null,"◎●⑦あいちの米粉パン",null,"ごはん",null,"麦ごはん",null,"◎●⑦ロールパン",null,"　"]
["牛乳","◎牛乳",null,"◎牛乳",null,"◎牛乳",null,"◎牛乳",null,"◎はっこう乳",null,"　"]
[null,"通常給食","アレルギー給食\n(卵･乳･えび･かに除去)","通常給食","アレルギー給食\n(卵･乳･えび･かに除去)","通常給食","アレルギー給食\n(卵･乳･えび･かに除去)","通常給食","アレルギー給食\n(卵･乳･えび･かに除去)","通常給食","アレルギー給食\n(卵･乳･えび･かに除去)","　"]
["食缶","【えがおの夏野菜\n　　　　　　カレー】",null,"【じゃがいもスープ】","【＊じゃがいもスープ】","【さわにわん】",null,"【じゃがいもだんご汁】",null,"【ABCスープ】",null,"　"]
[null,"　たまねぎ(52)",null,"　たまねぎ(52)","　たまねぎ(52)","⑩豚肉(26)",null,"　じゃがいもだんご(32.5)",null,"　じゃがいも(32.5)",null,"　"]
[null,"　じゃがいも(39)",null,"　じゃがいも(52)","　じゃがいも(52)","⑫ながいも(19.5)",null,"　たまねぎ(26)",null,"　たまねぎ(26)",null,"　"]
[null,"　トマト(26)",null,"　マッシュポテト(26)","　マッシュポテト(26)","　かまぼこ(13)",null,"⑧鶏肉(13)",null,"⑧鶏肉(13)",null,"　"]
[null,"　なす(19.5)",null,"　にんじん(13)","　にんじん(13)","　にんじん(13)",null,"　かまぼこ(13)",null,"　とうもろこし(13)",null,"　"]
[null,"⑩豚肉(19.5)",null,"⑧鶏肉(19.5)","⑧鶏肉(19.5)","　たけのこ(13)",null,"　にんじん(10.4)",null,"　ひよこ豆(13)",null,"　"]
[null,"　にんじん(13)",null,"　マッシュルーム(6.5)","　マッシュルーム(6.5)","　ごぼう(13)",null,"　ねぎ(10.4)",null,"　にんじん(13)",null,"　"]
[null,"　ピーマン(6.5)",null,"　パセリ(0.07)","　パセリ(0.07)","　小松菜(13)",null,"　しいたけ(1.3)",null,"●ABCパスタ(3.9)",null,"　"]
[null,"　しょうが(0.65)",null,"◎牛乳(39)","⑦豆乳(39)","●⑦しょうゆ(5.2)",null,"●⑦しょうゆ(5.2)",null,"⑦⑩洋風だしの素(2.6)",null,"　"]
[null,"　にんにく(0.26)",null,"◎生クリーム(3.9)","⑦⑩洋風だしの素(3.9)","　塩(0.39)",null,"　本みりん(1.3)",null,"　白ワイン(1.3)",null,"　"]
[null,"　カレールウ\n        [えがお](14.3)",null,"⑦⑩洋風だしの素(2.6)","　塩(0.52)","　こしょう(0.03)",null,"　塩(0.39)",null,"●⑦しょうゆ(1.3)",null,"　"]
[null,"　ソース(3.25)",null,"◎バター(0.65)","　こしょう(0.04)","　だし",null,"　だし",null,"　塩(0.39)",null,"　"]
[null,"　トマトケチャップ (2.6)",null,"　塩(0.52)",null,"",null,"",null,"　こしょう(0.04)",null,"　"]
[null,"⑦⑩洋風だしの素(1.95)",null,"　こしょう(0.04)",null,"",null,"",null,"",null,"　"]
[null,"●⑦しょうゆ(0.91)",null,"",null,"",null,"",null,"",null,"　"]
[null,"　純カレー(0.39)",null,"",null,"",null,"",null,"",null,"　"]
[null,"　塩(0.13)",null,"",null,"",null,"",null,"",null,"　"]
[null,"　こしょう(0.03)",null,"",null,"",null,"",null,"",null,"　"]
[null,"",null,"",null,"",null,"",null,"",null,"　"]
["フライ缶","【ツナサラダ】",null,"【キャベツと\n  　ウインナーの\n　　　　　ソテー】",null,"【さば銀紙焼き】",null,"【ピリ辛大豆】",null,"【ハンバーグの\n 　　いちじくソース\n　　　　　　　がけ】",null,"　"]
[null,"　キャベツ(26)",null,"　キャベツ(45.5)",null,"　さば銀紙焼き(60)",null,"⑦大豆(32.5)",null,"　ハンバーグ(60)",null,"　"]
[null,"　きゅうり(26)",null,"⑩ポークウインナー\n　　　　　　(32.5)",null,"",null,"⑩豚肉(32.5)",null,"　いちじくピューレ\n　　　　　　(3.25)",null,"　"]
[null,"　まぐろ油漬け(16.9)",null,"　にんじん(6.5)",null,"《さば銀紙焼き》",null,"　たまねぎ(32.5)",null,"●⑦しょうゆ(2.6)",null,"　"]
[null,"　とうもろこし(6.5)",null,"　米油(0.65)",null,"⑥さば",null,"　にんじん(6.5)",null,"　砂糖(1.56)",null,"　"]
[null,"　にんじん(3.9)",null,"　塩(0.26)",null,"⑦調味料等",null,"⑦枝豆(6.5)",null,"　レモン果汁(0.39)",null,"　"]
[null,"　砂糖(1.3)",null,"　こしょう(0.03)",null,"",null,"　しょうが(0.39)",null,"　でん粉(0.39)",null,"　"]
[null,"　ワインビネガー(1.3)",null,"",null,"",null,"●⑦しょうゆ(3.25)",null,"",null,"　"]
[null,"●⑦しょうゆ(1.04)",null,"",null,"",null,"　砂糖(0.78)",null,"《ハンバーグ》",null,"　"]
[null,"　オリーブ油(0.65)",null,"",null,"",null,"　酒(0.65)",null,"⑧鶏肉",null,"　"]
[null,"　塩(0.13)",null,"",null,"",null,"④ごま油(0.26)",null,"　たまねぎ",null,"　"]
[null,"　こしょう(0.03)",null,"",null,"",null,"⑦⑧⑩中華だしの素\n                 (0.26)",null,"⑩豚肉",null,"　"]
[null,"",null,"",null,"",null,"　一味唐辛子(0.07)",null,"　でん粉",null,"　"]
[null,"",null,"",null,"",null,"　にんにく(0.01)",null,"⑩調味料等",null,"　"]
[null,"",null,"",null,"",null,"",null,"",null,"　"]
["あえ物・果物","【冷凍みかん】",null,"",null,"【もやしのごまじょうゆ和え】",null,"",null,"",null,"　"]
[null,"　みかん(120)",null,"",null,"　もやし(32.5)",null,null,null,"",null,"　"]
[null,"",null,"",null,"④白ごま(0.65)",null,null,null,"",null,"　"]
[null,"",null,"",null,"●⑦しょうゆ(1.56)",null,null,null,"",null,"　"]
[null,"",null,"",null,"④ごま油(0.26)",null,null,null,"",null,"　"]
[null,"",null,"",null,"",null,"",null,"",null,"　"]
["その他",null,null,"",null,"【きらず揚げ】",null,"【アセロラゼリー】",null,"",null,"　"]
[null,"",null,"",null,"　きらず揚げ(8)",null,"　アセロラゼリー(40)",null,"",null,"　"]
[null,null,null,null,null,null,null,null,null,null,null,"　"]
[null,null,null,null,null,"《きらず揚げ》",null,null,null,null,null,"　"]
[null,null,null,null,null,"●小麦粉",null,null,null,null,null,"　"]
[null,null,null,null,null,"⑦おからパウダー ",null,null,null,null,null,"　"]
[null,null,null,null,null,"　調味料等 ",null,null,null,null,null,"　"]
[null,"",null,"",null,"",null,"",null,"",null,"　"]
["　",null,null,null,null,null,null,null,null,null,"（　）内は純使用量　単位：グラム","　"]
["　",null,null,null,null,null,null,null,null,null,null,"　"]
["　",null,null,null,null,null,null,null,null,null,"中学校－２","　"]
["日","2026-09-09",null,"2026-09-10",null,"2026-09-11",null,"2026-09-14",null,"2026-09-15",null,"　"]
["主食","ごはん",null,"●中華めん",null,"ごはん",null,"麦ごはん",null,"◎●⑦ミルクロールパン",null,"　"]
["牛乳","◎牛乳",null,"◎牛乳",null,"◎牛乳",null,"◎牛乳",null,"◎牛乳",null,"　"]
[null,"通常給食","アレルギー給食\n(卵･乳･えび･かに除去)","通常給食","アレルギー給食\n(卵･乳･えび･かに除去)","通常給食","アレルギー給食\n(卵･乳･えび･かに除去)","通常給食","アレルギー給食\n(卵･乳･えび･かに除去)","通常給食","アレルギー給食\n(卵･乳･えび･かに除去)","　"]
["食缶","【高野豆腐の卵とじ】","【＊高野豆腐の\n               うま煮】","【しょうゆラーメン\n                   の汁】",null,"【トッポギスープ】",null,"【スタミナ汁】",null,"【大豆とチキンの\n　　　　トマト煮】",null,"　"]
[null,"○液卵(52)","　たまねぎ(52)","　もやし(19.5)",null,"　たまねぎ(32.5)",null,"⑦豆腐(26)",null,"　たまねぎ(52)",null,"　"]
[null,"　たまねぎ(39)","　じゃがいも(45.5)","⑩豚肉(19.5)",null,"　トッポギ(26)",null,"　じゃがいも(26)",null,"⑦大豆(45.5)",null,"　"]
[null,"　じゃがいも(32.5)","⑧鶏肉(39)","　なると(13)",null,"⑧鶏肉(26)",null,"　たまねぎ(26)",null,"　にんじん(26)",null,"　"]
[null,"⑧鶏肉(13)","　にんじん(13)","　とうもろこし(13)",null,"　にんじん(13)",null,"⑩豚肉(19.5)",null,"　じゃがいも(26)",null,"　"]
[null,"　にんじん(13)","　さやいんげん(6.5)","　ねぎ(13)",null,"　ねぎ(6.5)",null,"　にんじん(13)",null,"　トマト(26)",null,"　"]
[null,"　さやいんげん(6.5)","⑦高野豆腐(10.4)","　たけのこ(13)",null,"　とうもろこし(6.5)",null,"　ねぎ(6.5)",null,"⑧鶏肉(19.5)",null,"　"]
[null,"⑦高野豆腐(6.5)","●⑦しょうゆ(5.2)","　にんじん(13)",null,"　わかめ(0.39)",null,"⑦油揚げ(3.9)",null,"　セロリ(2.6)",null,"　"]
[null,"●⑦しょうゆ(5.2)","　砂糖(2.6)","　わかめ(0.52)",null,"⑧⑩中華ガラスープ\n　　　　　の素(4.55)",null,"　にんにく(0.26)",null,"　にんにく(0.39)",null,"　"]
[null,"　砂糖(2.6)","　本みりん(1.3)","⑧チキンブイヨン(39)",null,"●⑦しょうゆ(1.56)",null,"⑦合わせみそ(11.7)",null,"　トマトジュース(26)",null,"　"]
[null,"　本みりん(1.3)","　塩(0.26)","●⑦しょうゆ(9.75)",null,"　酒(1.3)",null,"　だし",null,"　トマトケチャップ(9.1)",null,"　"]
[null,"　塩(0.26)","　でん粉(0.65)","⑦⑧⑩中華だしの素\n　　　　　　(1.95)",null,"　塩(0.13)",null,"",null,"　ソース(2.6)",null,"　"]
[null,"　だし","　だし","④ごま油(0.39)",null,"　こしょう(0.04)",null,"",null,"　砂糖(2.6)",null,"　"]
[null,"",null,"　塩(0.16)",null,"",null,"",null,"⑦⑩洋風だしの素(1.3)",null,"　"]
[null,"",null,"　こしょう(0.05)",null,"",null,"",null,"　赤ワイン(1.3)",null,"　"]
[null,"",null,"",null,"",null,"",null,"　塩(0.52)",null,"　"]
[null,"",null,"",null,"",null,"",null,"　こしょう(0.04)",null,"　"]
[null,"",null,"",null,"",null,"",null,"",null,"　"]
["フライ缶","【ちくわの\n         いそべ揚げ】",null,"【里芋コロッケ】",null,"【キムタクごはんの具】",null,"【まぐろの甘辛煮】",null,"【コーンサラダ】",null,"　"]
[null,"　ちくわ(60)",null,"　里芋コロッケ(60)",null,"　キムチ(39)",null,"　まぐろ油漬け(58.5)",null,"　キャベツ(32.5)",null,"　"]
[null,"●小麦粉(3.9)",null,"　米油(6)",null,"⑩豚肉(39)",null,"　キャベツ(15.6)",null,"　とうもろこし(26)",null,"　"]
[null,"　でん粉(1.3)",null,"",null,"⑦枝豆(6.5)",null,"　しょうが(1.3)",null,"　まぐろ油漬け(13)",null,"　"]
[null,"　青のり粉(0.16)",null,"《里芋コロッケ》",null,"　つぼ漬(6.5)",null,"　砂糖(3.9)",null,"　にんじん(6.5)",null,"　"]
[null,"　米油(6.54)",null,"　里芋",null,"　本みりん(1.3)",null,"●⑦しょうゆ(1.95)",null,"●⑦しょうゆ(1.56)",null,"　"]
[null,"",null,"⑧鶏肉",null,"④ごま油(0.39)",null,"　本みりん(1.3)",null,"　砂糖(1.3)",null,"　"]
[null,"",null,"●パン粉",null,"",null,"　酒(1.3)",null,"　ワインビネガー(1.3)",null,"　"]
[null,"",null,"●小麦粉",null,"",null,"",null,"　サラダ油(0.65)",null,"　"]
[null,"",null,"⑦植物性たん白",null,"",null,"",null,"　塩(0.13)",null,"　"]
[null,"",null,"●⑦調味料等",null,"",null,"",null,"　こしょう(0.03)",null,"　"]
[null,"",null,"",null,"",null,"",null,"",null,"　"]
["あえ物・果物","【キャベツとにんじんのおかか和え】",null,"【きゅうりのナムル】",null,"",null,"【きざみたくあん】",null,"",null,"　"]
[null,"　キャベツ(26)",null,"　きゅうり(39)",null,"",null,"　たくあん漬け(16.9)",null,"",null,"　"]
[null,"　にんじん(6.5)",null,"④白ごま(1.3)",null,"",null,"",null,"",null,"　"]
[null,"　花かつお(0.26)",null,"●⑦しょうゆ(1.3)",null,"",null,"《たくあん漬け》",null,"",null,"　"]
[null,"●⑦しょうゆ(1.3)",null,"　砂糖(0.65)",null,"",null,"　大根",null,"",null,"　"]
[null,"　砂糖(0.39)",null,"　米酢(0.65)",null,"",null,"●⑦調味料等",null,"",null,"　"]
[null,"",null,"④ごま油(0.39)",null,"",null,"",null,"",null,"　"]
[null,"",null,"",null,"",null,"",null,"",null,"　"]
["その他","",null,"",null,"【バナナチップス】",null,"【手巻きのり】",null,"",null,"　"]
[null,"",null,"",null,"⑨バナナチップス(10)",null,"　のり(3)",null,"",null,"　"]
[null,"",null,"",null,"",null,"",null,"",null,"　"]
[null,"",null,"",null,"",null,"",null,"",null,"　"]
["　",null,null,null,null,null,null,null,null,null,"（　）内は純使用量　単位：グラム","　"]
["※","アレルギー物質の19品目について、次のように表示しています。",null,null,null,null,null,null,null,null,null,"　"]
["　","○…卵","◎…乳","●…小麦","△…えび","▲…かに",null,"※　春日井市食育推進給食会ホームページに、当市が表示するアレルゲン19品目",null,null,null,"　"]
["　","①…いか","②…オレンジ","③…牛肉","④…ごま","⑤…さけ",null,"　 のアレルギーマークを検索して強調表示する機能を持つ「マーク強調機能付",null,null,null,"　"]
["　","⑥…さば","⑦…大豆","⑧…鶏肉","⑨…バナナ","⑩…豚肉",null,"　 アレルギー献立表」を掲載しています。",null,null,null,"　"]
["　","⑪…もも","⑫…やまいも","⑬…りんご","⑭…ゼラチン",null,null,"　　　https://www.kasugai-kyushoku.com/kondatehyou/allergy_mark/",null,null,null,"　"]
[null,"１　パンに表示される⑦大豆については、油、乳化剤（大豆由来）のアレルゲンを示します。",null,null,null,null,null,null,null,null,null,"　"]
[null,"２　アレルギー献立表の見方については、「保存版ＮＯ．１」を参照してください。",null,null,null,null,null,null,null,null,null,"　"]
[null,"３　「むろ削り」または「和風だしの素」については、「だし」と表記しています。",null,null,null,null,null,null,null,null,null,"　"]
[null,null,null,null,null,null,null,null,null,null,null,"　"]
["　",null,null,null,null,null,null,null,null,null,null,"　"]
["　",null,null,null,null,null,null,null,null,null,"中学校－３","　"]
["日","2026-09-16",null,"2026-09-17",null,"2026-09-18",null,"2026-09-24",null,"2026-09-25",null,"　"]
["主食","麦ごはん",null,"ごはん",null,"麦ごはん",null,"麦ごはん",null,"ごはん",null,"　"]
{"$rows_left_out":95}
{"sheet":"対象者","index":1,"n_rows":101,"n_cols":21,"rows_kept":101,"cut":false,"hidden":true,"merged":[]}
["番号","学校","学年","組","氏名","アレ１","１記号","アレ２","２記号","アレ３","３記号","アレ４","４記号","アレ５","５記号","アレ６","６記号","アレ７","７記号",1,"アレルゲンはドロップダウンリストから選択してください。"]
[1,null,null,null,null,null,"---",null,"---",null,"---",null,"---",null,"---",null,"---",null,"---",2,"アレルギー献立表に表示可能なアレルゲンは５種類までとなります。※６、７は参考入力"]
[2,null,null,null,null,null,"---",null,"---",null,"---",null,"---",null,"---",null,"---",null,"---","※","５種類を超えるアレルゲンのある場合は、弁当持参を促すべき児童生徒と言えます。"]
[3,null,null,null,null,null,"---",null,"---",null,"---",null,"---",null,"---",null,"---",null,"---",3,"このリストをアレルギー献立表の「対象者」シートにコピーして「値のみ」を貼り付けてください。"]
[4,null,null,null,null,null,"---",null,"---",null,"---",null,"---",null,"---",null,"---",null,"---",4,"対象者を100人以上登録したいときは、A100～R101を選択してコピー（又はオートフィル）してください。"]
[5,null,null,null,null,null,"---",null,"---",null,"---",null,"---",null,"---",null,"---",null,"---"]
[6,null,null,null,null,null,"---",null,"---",null,"---",null,"---",null,"---",null,"---",null,"---"]
[7,null,null,null,null,null,"---",null,"---",null,"---",null,"---",null,"---",null,"---",null,"---"]
[8,null,null,null,null,null,"---",null,"---",null,"---",null,"---",null,"---",null,"---",null,"---"]
[9,null,null,null,null,null,"---",null,"---",null,"---",null,"---",null,"---",null,"---",null,"---"]
[10,null,null,null,null,null,"---",null,"---",null,"---",null,"---",null,"---",null,"---",null,"---"]
[11,null,null,null,null,null,"---",null,"---",null,"---",null,"---",null,"---",null,"---",null,"---"]
[12,null,null,null,null,null,"---",null,"---",null,"---",null,"---",null,"---",null,"---",null,"---"]
[13,null,null,null,null,null,"---",null,"---",null,"---",null,"---",null,"---",null,"---",null,"---"]
[14,null,null,null,null,null,"---",null,"---",null,"---",null,"---",null,"---",null,"---",null,"---"]
[15,null,null,null,null,null,"---",null,"---",null,"---",null,"---",null,"---",null,"---",null,"---"]
[16,null,null,null,null,null,"---",null,"---",null,"---",null,"---",null,"---",null,"---",null,"---"]
[17,null,null,null,null,null,"---",null,"---",null,"---",null,"---",null,"---",null,"---",null,"---"]
[18,null,null,null,null,null,"---",null,"---",null,"---",null,"---",null,"---",null,"---",null,"---"]
[19,null,null,null,null,null,"---",null,"---",null,"---",null,"---",null,"---",null,"---",null,"---"]
[20,null,null,null,null,null,"---",null,"---",null,"---",null,"---",null,"---",null,"---",null,"---"]
[21,null,null,null,null,null,"---",null,"---",null,"---",null,"---",null,"---",null,"---",null,"---"]
[22,null,null,null,null,null,"---",null,"---",null,"---",null,"---",null,"---",null,"---",null,"---"]
[23,null,null,null,null,null,"---",null,"---",null,"---",null,"---",null,"---",null,"---",null,"---"]
[24,null,null,null,null,null,"---",null,"---",null,"---",null,"---",null,"---",null,"---",null,"---"]
[25,null,null,null,null,null,"---",null,"---",null,"---",null,"---",null,"---",null,"---",null,"---"]
[26,null,null,null,null,null,"---",null,"---",null,"---",null,"---",null,"---",null,"---",null,"---"]
[27,null,null,null,null,null,"---",null,"---",null,"---",null,"---",null,"---",null,"---",null,"---"]
[28,null,null,null,null,null,"---",null,"---",null,"---",null,"---",null,"---",null,"---",null,"---"]
[29,null,null,null,null,null,"---",null,"---",null,"---",null,"---",null,"---",null,"---",null,"---"]
[30,null,null,null,null,null,"---",null,"---",null,"---",null,"---",null,"---",null,"---",null,"---"]
[31,null,null,null,null,null,"---",null,"---",null,"---",null,"---",null,"---",null,"---",null,"---"]
[32,null,null,null,null,null,"---",null,"---",null,"---",null,"---",null,"---",null,"---",null,"---"]
[33,null,null,null,null,null,"---",null,"---",null,"---",null,"---",null,"---",null,"---",null,"---"]
[34,null,null,null,null,null,"---",null,"---",null,"---",null,"---",null,"---",null,"---",null,"---"]
[35,null,null,null,null,null,"---",null,"---",null,"---",null,"---",null,"---",null,"---",null,"---"]
[36,null,null,null,null,null,"---",null,"---",null,"---",null,"---",null,"---",null,"---",null,"---"]
[37,null,null,null,null,null,"---",null,"---",null,"---",null,"---",null,"---",null,"---",null,"---"]
[38,null,null,null,null,null,"---",null,"---",null,"---",null,"---",null,"---",null,"---",null,"---"]
[39,null,null,null,null,null,"---",null,"---",null,"---",null,"---",null,"---",null,"---",null,"---"]
[40,null,null,null,null,null,"---",null,"---",null,"---",null,"---",null,"---",null,"---",null,"---"]
[41,null,null,null,null,null,"---",null,"---",null,"---",null,"---",null,"---",null,"---",null,"---"]
[42,null,null,null,null,null,"---",null,"---",null,"---",null,"---",null,"---",null,"---",null,"---"]
[43,null,null,null,null,null,"---",null,"---",null,"---",null,"---",null,"---",null,"---",null,"---"]
[44,null,null,null,null,null,"---",null,"---",null,"---",null,"---",null,"---",null,"---",null,"---"]
[45,null,null,null,null,null,"---",null,"---",null,"---",null,"---",null,"---",null,"---",null,"---"]
[46,null,null,null,null,null,"---",null,"---",null,"---",null,"---",null,"---",null,"---",null,"---"]
[47,null,null,null,null,null,"---",null,"---",null,"---",null,"---",null,"---",null,"---",null,"---"]
[48,null,null,null,null,null,"---",null,"---",null,"---",null,"---",null,"---",null,"---",null,"---"]
[49,null,null,null,null,null,"---",null,"---",null,"---",null,"---",null,"---",null,"---",null,"---"]
[50,null,null,null,null,null,"---",null,"---",null,"---",null,"---",null,"---",null,"---",null,"---"]
[51,null,null,null,null,null,"---",null,"---",null,"---",null,"---",null,"---",null,"---",null,"---"]
[52,null,null,null,null,null,"---",null,"---",null,"---",null,"---",null,"---",null,"---",null,"---"]
[53,null,null,null,null,null,"---",null,"---",null,"---",null,"---",null,"---",null,"---",null,"---"]
[54,null,null,null,null,null,"---",null,"---",null,"---",null,"---",null,"---",null,"---",null,"---"]
[55,null,null,null,null,null,"---",null,"---",null,"---",null,"---",null,"---",null,"---",null,"---"]
[56,null,null,null,null,null,"---",null,"---",null,"---",null,"---",null,"---",null,"---",null,"---"]
[57,null,null,null,null,null,"---",null,"---",null,"---",null,"---",null,"---",null,"---",null,"---"]
[58,null,null,null,null,null,"---",null,"---",null,"---",null,"---",null,"---",null,"---",null,"---"]
[59,null,null,null,null,null,"---",null,"---",null,"---",null,"---",null,"---",null,"---",null,"---"]
[60,null,null,null,null,null,"---",null,"---",null,"---",null,"---",null,"---",null,"---",null,"---"]
[61,null,null,null,null,null,"---",null,"---",null,"---",null,"---",null,"---",null,"---",null,"---"]
[62,null,null,null,null,null,"---",null,"---",null,"---",null,"---",null,"---",null,"---",null,"---"]
[63,null,null,null,null,null,"---",null,"---",null,"---",null,"---",null,"---",null,"---",null,"---"]
[64,null,null,null,null,null,"---",null,"---",null,"---",null,"---",null,"---",null,"---",null,"---"]
[65,null,null,null,null,null,"---",null,"---",null,"---",null,"---",null,"---",null,"---",null,"---"]
[66,null,null,null,null,null,"---",null,"---",null,"---",null,"---",null,"---",null,"---",null,"---"]
[67,null,null,null,null,null,"---",null,"---",null,"---",null,"---",null,"---",null,"---",null,"---"]
[68,null,null,null,null,null,"---",null,"---",null,"---",null,"---",null,"---",null,"---",null,"---"]
[69,null,null,null,null,null,"---",null,"---",null,"---",null,"---",null,"---",null,"---",null,"---"]
[70,null,null,null,null,null,"---",null,"---",null,"---",null,"---",null,"---",null,"---",null,"---"]
[71,null,null,null,null,null,"---",null,"---",null,"---",null,"---",null,"---",null,"---",null,"---"]
[72,null,null,null,null,null,"---",null,"---",null,"---",null,"---",null,"---",null,"---",null,"---"]
[73,null,null,null,null,null,"---",null,"---",null,"---",null,"---",null,"---",null,"---",null,"---"]
[74,null,null,null,null,null,"---",null,"---",null,"---",null,"---",null,"---",null,"---",null,"---"]
[75,null,null,null,null,null,"---",null,"---",null,"---",null,"---",null,"---",null,"---",null,"---"]
[76,null,null,null,null,null,"---",null,"---",null,"---",null,"---",null,"---",null,"---",null,"---"]
[77,null,null,null,null,null,"---",null,"---",null,"---",null,"---",null,"---",null,"---",null,"---"]
[78,null,null,null,null,null,"---",null,"---",null,"---",null,"---",null,"---",null,"---",null,"---"]
[79,null,null,null,null,null,"---",null,"---",null,"---",null,"---",null,"---",null,"---",null,"---"]
[80,null,null,null,null,null,"---",null,"---",null,"---",null,"---",null,"---",null,"---",null,"---"]
[81,null,null,null,null,null,"---",null,"---",null,"---",null,"---",null,"---",null,"---",null,"---"]
[82,null,null,null,null,null,"---",null,"---",null,"---",null,"---",null,"---",null,"---",null,"---"]
[83,null,null,null,null,null,"---",null,"---",null,"---",null,"---",null,"---",null,"---",null,"---"]
[84,null,null,null,null,null,"---",null,"---",null,"---",null,"---",null,"---",null,"---",null,"---"]
[85,null,null,null,null,null,"---",null,"---",null,"---",null,"---",null,"---",null,"---",null,"---"]
[86,null,null,null,null,null,"---",null,"---",null,"---",null,"---",null,"---",null,"---",null,"---"]
[87,null,null,null,null,null,"---",null,"---",null,"---",null,"---",null,"---",null,"---",null,"---"]
[88,null,null,null,null,null,"---",null,"---",null,"---",null,"---",null,"---",null,"---",null,"---"]
[89,null,null,null,null,null,"---",null,"---",null,"---",null,"---",null,"---",null,"---",null,"---"]
[90,null,null,null,null,null,"---",null,"---",null,"---",null,"---",null,"---",null,"---",null,"---"]
[91,null,null,null,null,null,"---",null,"---",null,"---",null,"---",null,"---",null,"---",null,"---"]
[92,null,null,null,null,null,"---",null,"---",null,"---",null,"---",null,"---",null,"---",null,"---"]
[93,null,null,null,null,null,"---",null,"---",null,"---",null,"---",null,"---",null,"---",null,"---"]
[94,null,null,null,null,null,"---",null,"---",null,"---",null,"---",null,"---",null,"---",null,"---"]
[95,null,null,null,null,null,"---",null,"---",null,"---",null,"---",null,"---",null,"---",null,"---"]
[96,null,null,null,null,null,"---",null,"---",null,"---",null,"---",null,"---",null,"---",null,"---"]
[97,null,null,null,null,null,"---",null,"---",null,"---",null,"---",null,"---",null,"---",null,"---"]
[98,null,null,null,null,null,"---",null,"---",null,"---",null,"---",null,"---",null,"---",null,"---"]
[99,null,null,null,null,null,"---",null,"---",null,"---",null,"---",null,"---",null,"---",null,"---"]
[100,null,null,null,null,null,"---",null,"---",null,"---",null,"---",null,"---",null,"---",null,"---"]

{"sheet":"アレルゲン","index":2,"n_rows":5,"n_cols":4,"rows_kept":5,"cut":false,"hidden":true,"merged":[]}
[1,{"$f":"VLOOKUP(D$1,対象者!$A:$S,7,FALSE)","v":{"$error":"#N/A"}},"個人番号",{"$f":"'アレルギー献立表（中）'!M3","v":0}]
[2,{"$f":"VLOOKUP(D$1,対象者!$A:$S,9,FALSE)","v":{"$error":"#N/A"}}]
[3,{"$f":"VLOOKUP(D$1,対象者!$A:$S,11,FALSE)","v":{"$error":"#N/A"}}]
[4,{"$f":"VLOOKUP(D$1,対象者!$A:$S,13,FALSE)","v":{"$error":"#N/A"}}]
[5,{"$f":"VLOOKUP(D$1,対象者!$A:$S,15,FALSE)","v":{"$error":"#N/A"}}]