{"text_format":"1","workbook":"xlsx","n_sheets":3,"sheets":["アレルギー献立表（小学校）","対象者","アレルゲン"],"not_rendered":{"charts":0,"images":1,"macros":1,"external_links":0,"defined_names":1,"comments":0,"pivot_tables":0},"unopened":[],"bounds":{"document_bytes":16777216,"sheet_cells":100000,"rows_first":2000,"rows_last":500,"rows_between":2000,"halvings":0,"cell_chars":16384,"cell_head_chars":4096},"cells_cut":0,"cells_raw":0,"read":"whole","date_system":"1900"}

{"sheet":"アレルギー献立表（小学校）","index":0,"n_rows":161,"n_cols":13,"rows_kept":161,"cut":false,"hidden":false,"merged":[[120,3,120,4],[5,1,5,2],[156,0,159,0],[9,0,25,0],[26,0,40,0],[41,0,50,0],[51,0,58,0],[66,0,81,0],[82,0,104,0],[105,0,112,0],[113,0,116,0],[124,0,137,0],[138,0,150,0],[151,0,155,0]]}
[null,{"$f":"CONCATENATE(IFERROR(VLOOKUP($M$3,対象者!$A:$O,2,FALSE),\"\"),DBCS(IFERROR(VLOOKUP($M$3,対象者!$A:$O,3,FALSE),\"\")),IFERROR(IF($M$3=\"\",\"\",\"年\"),\"\"))","v":""},{"$f":"IFERROR(VLOOKUP($M$3,対象者!$A:$O,4,FALSE),\"\")","v":""},{"$f":"IFERROR(VLOOKUP($M$3,対象者!$A:$O,5,FALSE),\"\")","v":""},null,null,null,null,null,null,null,"　"]
[null,{"$f":"CONCATENATE(IFERROR(VLOOKUP($M$3,対象者!$A:$O,6,FALSE),\"\"),\" \",IFERROR(VLOOKUP($M$3,対象者!$A:$O,7,FALSE),\"\"))","v":" "},{"$f":"CONCATENATE(IFERROR(VLOOKUP($M$3,対象者!$A:$O,8,FALSE),\"\"),\" \",IFERROR(VLOOKUP($M$3,対象者!$A:$O,9,FALSE),\"\"))","v":" "},{"$f":"CONCATENATE(IFERROR(VLOOKUP($M$3,対象者!$A:$O,10,FALSE),\"\"),\" \",IFERROR(VLOOKUP($M$3,対象者!$A:$O,11,FALSE),\"\"))","v":" "},{"$f":"CONCATENATE(IFERROR(VLOOKUP($M$3,対象者!$A:$O,12,FALSE),\"\"),\" \",IFERROR(VLOOKUP($M$3,対象者!$A:$O,13,FALSE),\"\"))","v":" "},{"$f":"CONCATENATE(IFERROR(VLOOKUP($M$3,対象者!$A:$O,14,FALSE),\"\"),\" \",IFERROR(VLOOKUP($M$3,対象者!$A:$O,15,FALSE),\"\"))","v":" "},null,null,null,null,null,"　","番号"]
["　","令和8年度　7月アレルギー献立表（通常献立、アレルギー給食献立）",null,null,null,null,null,null,null,null,"小学校－１","　"]
[null,"１　通常給食を食べている人（一部を無配膳対応としている人を含む）は、「通常給食」欄を確認してください。",null,null,null,null,null,null,null,null,null,"　"]
[null,"２　アレルギー給食（卵･乳･えび･かにを除去した給食）を食べている人は、「アレルギー給食」欄を確認してください。ただし、通常給食とアレルギー給食の献立内容が同じ場合は、アレルギー給食の欄は空欄としています。",null,null,null,null,null,null,null,null,null,"　"]
["日","2026-07-01",null,"2026-07-02",null,"2026-07-03",null,"2026-07-06",null,"2026-07-07",null,"　"]
["主食","ごはん",null,"わかめごはん",null,"◎●⑦ミルクロールパン",null,"麦ごはん",null,"麦ごはん",null,"　"]
["牛乳","◎牛乳",null,"◎牛乳",null,"◎牛乳",null,"◎牛乳",null,"◎牛乳",null,"　"]
[null,"通常給食","アレルギー給食\n(卵･乳･えび･かに除去)","通常給食","アレルギー給食\n(卵･乳･えび･かに除去)","通常給食","アレルギー給食\n(卵･乳･えび･かに除去)","通常給食","アレルギー給食\n(卵･乳･えび･かに除去)","通常給食","アレルギー給食\n(卵･乳･えび･かに除去)","　"]
["食缶","【スタミナ肉じゃが】",null,"【かきたま汁】","【*すまし汁】","【大豆のインド煮】",null,"【わかめスープ】",null,"【七夕汁】",null,"　"]
[null,"　じゃがいも(90)",null,"⑦豆腐(25)","⑦豆腐(30)","　たまねぎ(70)",null,"　たまねぎ(25)",null,"　大根(20)",null,"　"]
[null,"　たまねぎ(40)",null,"○液卵(20)","　たまねぎ(20)","⑦大豆(40)",null,"⑦豆腐(25)",null,"⑧鶏肉(15)",null,"　"]
[null,"　しらたき(25)",null,"　たまねぎ(15)","⑧鶏肉(10)","　にんじん(25)",null,"⑧鶏肉(10)",null,"　にんじん(10)",null,"　"]
[null,"⑩豚肉(15)",null,"⑧鶏肉(10)","　かまぼこ(15)","⑩豚肉(18)",null,"　にんじん(10)",null,"　オクラ(8)",null,"　"]
[null,"　にんじん(20)",null,"　かまぼこ(10)","　にんじん(10)","　トマトピューレ(6)",null,"　ねぎ(6)",null,"　ねぎ(5)",null,"　"]
[null,"④白ごま(2)",null,"　にんじん(5)","　えのきたけ(5)","　マッシュルーム(6)",null,"　とうもろこし(5)",null,"●サボテンきしめん(5)",null,"　"]
[null,"　にんにく(0.3)",null,"　えのきたけ(5)","　ねぎ(5)","　カレールウ\n　　　　[えがお](4.8)",null,"　わかめ(0.5)",null,"　星型かまぼこ(5)",null,"　"]
[null,"●⑦しょうゆ(4)",null,"　ねぎ(5)","●⑦しょうゆ(4)","　ソース(2.4)",null,"⑧チキンブイヨン(20)",null,"　しいたけ(1)",null,"　"]
[null,"　砂糖(2.5)",null,"●⑦しょうゆ(4)","　塩(0.3)","⑦⑩洋風だしの素(1.2)",null,"●⑦しょうゆ(2.5)",null,"●⑦しょうゆ(4)",null,"　"]
[null,"⑦コチジャン(1)",null,"　塩(0.3)","　でん粉(1)","　純カレー(0.42)",null,"④白ごま(1)",null,"　塩(0.2)",null,"　"]
[null,"　本みりん(1)",null,"　でん粉(1)","　だし","　塩(0.24)",null,"⑦⑧⑩中華だしの素(1)",null,"　だし",null,"　"]
[null,"④ごま油(0.5)",null,"　だし",null,"　こしょう(0.02)",null,"　塩(0.4)",null,"",null,"　"]
[null,"　塩(0.2)",null,"",null,"",null,"④ごま油(0.1)",null,"",null,"　"]
[null,"　豆板醤(0.1)",null,"",null,"",null,"　こしょう(0.03)",null,"",null,"　"]
[null,"　こしょう(0.03)",null,"",null,"",null,"",null,"",null,"　"]
[null,"",null,"",null,"",null,"",null,"",null,"　"]
["フライ缶","【さば銀紙焼き】",null,"【枝豆コロッケ】",null,"【フルーツの\n　　　　ゼリーあえ】",null,"【肉団子の甘酢あん】",null,"【なす入り肉みそ\n　　　ひじき丼の具】",null,"　"]
[null,"　さば銀紙焼き(50)",null,"　枝豆コロッケ(50)",null,"　いちごダイスゼリー\n　　　　　　　　(20)",null,"　肉団子(40)",null,"　たまねぎ(30)",null,"　"]
[null,"",null,"　米油(5)",null,"　みかんカットゼリー\n　　　　　　　　(20)",null,"　米油(4)",null,"⑩豚肉(30)",null,"　"]
[null,"≪さば銀紙焼き≫",null,"",null,"⑪黄桃(20)",null,"　たまねぎ(10)",null,"　なす(10)",null,"　"]
[null,"⑥さば",null,"≪枝豆コロッケ≫",null,"　パイナップル(20)",null,"　にんじん(10)",null,"　にんじん(8)",null,"　"]
[null,"⑦調味料等",null,"⑦枝豆",null,"",null,"　黄パプリカ(5)",null,"⑦枝豆(10)",null,"　"]
[null,"",null,"　じゃがいも",null,"",null,"　砂糖(1.5)",null,"　米ひじき(1.5)",null,"　"]
[null,"",null,"●パン粉",null,"",null,"　トマトケチャップ(2)",null,"　しょうが(1)",null,"　"]
[null,"",null,"●小麦粉",null,"",null,"●⑦しょうゆ(1.5)",null,"⑦豆みそ(4)",null,"　"]
[null,"",null,"⑦植物性たん白",null,"",null,"　米酢(1)",null,"　砂糖(2.5)",null,"　"]
[null,"",null,"　調味料等",null,"",null,"　でん粉(0.5)",null,"　酒(2)",null,"　"]
[null,"",null,"",null,"",null,"",null,"　本みりん(1.5)",null,"　"]
[null,"",null,"",null,"",null,null,null,"●⑦しょうゆ(1)",null,"　"]
[null,"",null,"",null,"",null,null,null,"　でん粉(0.5)",null,"　"]
[null,"",null,"",null,"",null,"",null,"",null,"　"]
["あえ物・果物","",null,"【きゅうりの塩昆布あえ】",null,"",null,"",null,"",null,"　"]
[null,"",null,"　きゅうり(25)",null,"",null,"　≪肉団子≫",null,"",null,"　"]
[null,"",null,"　にんじん(3)",null,"",null,"　⑧鶏肉",null,"",null,"　"]
[null,"",null,"　塩昆布(1.2)",null,"",null,"　　たまねぎ",null,"",null,"　"]
[null,null,null,null,null,null,null,"　●パン粉",null,null,null,"　"]
[null,null,null,"《塩昆布》",null,null,null,"　⑩豚肉",null,null,null,"　"]
[null,null,null,"　昆布",null,null,null,"　⑦粒状大豆たん白",null,null,null,"　"]
[null,null,null,"●⑦調味料等",null,null,null,"　⑦粉末状大豆たん白",null,null,null,"　"]
[null,null,null,null,null,null,null,"　●⑦調味料等",null,null,null,"　"]
[null,"",null,"",null,"",null,"",null,"",null,"　"]
["その他","",null,"",null,"",null,"【きらず揚げ】",null,"【バナナチップス】",null,"　"]
[null,"",null,"",null,"",null,"　きらず揚げ(8)",null,"⑨バナナチップス(10)",null,"　"]
[null,null,null,null,null,null,null,null,null,null,null,"　"]
[null,null,null,null,null,null,null,"≪きらず揚げ≫",null,null,null,"　"]
[null,null,null,null,null,null,null,"●小麦粉",null,null,null,"　"]
[null,null,null,null,null,null,null,"⑦おからパウダー",null,null,null,"　"]
[null,"",null,"",null,"",null,"　調味料等",null,"",null,"　"]
[null,"",null,"",null,"",null,"",null,"",null,"　"]
["　",null,null,null,null,null,null,null,null,null,"（　）内は純使用量　単位：グラム","　"]
["　",null,null,null,null,null,null,null,null,null,null,"　"]
["　",null,null,null,null,null,null,null,null,null,"小学校－２","　"]
["日","2026-07-08",null,"2026-07-09",null,"2026-07-10",null,"2026-07-13",null,"2026-07-14",null,"　"]
["主食","◎●⑦ツイストロールパン",null,"麦ごはん",null,"ごはん",null,"麦ごはん",null,"◎●⑦スライスパン",null,"　"]
["牛乳","◎牛乳",null,"◎はっこう乳",null,"◎牛乳",null,"◎牛乳",null,"◎牛乳",null,"　"]
[null,"通常給食","アレルギー給食\n(卵･乳･えび･かに除去)","通常給食","アレルギー給食\n(卵･乳･えび･かに除去)","通常給食","アレルギー給食\n(卵･乳･えび･かに除去)","通常給食","アレルギー給食\n(卵･乳･えび･かに除去)","通常給食","アレルギー給食\n(卵･乳･えび･かに除去)","　"]
["食缶","【夏野菜のスープ煮】",null,"【キーマカレー】",null,"【キムチ入り\n　　トッポギスープ】",null,"【かぼちゃ入り\n　　　　　みそ汁】",null,"【クリームコーン\n　　　　　　スープ】","【＊クリームコーン\n　　　　　　スープ】","　"]
[null,"　じゃがいも(30)",null,"　たまねぎ(60)",null,"　たまねぎ(25)",null,"　おじゃがもちボール\n　　　　かぼちゃ(20)",null,"　たまねぎ(40)","　たまねぎ(40)","　"]
[null,"　キャベツ(40)",null,"⑩豚肉(30)",null,"　トッポギ(20)",null,"⑦豆腐(20)",null,"　クリームコーン(25)","　クリームコーン(25)","　"]
[null,"　たまねぎ(30)",null,"　にんじん(20)",null,"⑧鶏肉(15)",null,"　かぼちゃ(15)",null,"⑧鶏肉(20)","⑧鶏肉(20)","　"]
[null,"　にんじん(20)",null,"⑦大豆(15)",null,"　キムチ(10)",null,"　大根(10)",null,"　にんじん(20)","　にんじん(20)","　"]
[null,"　ズッキーニ(10)",null,"　トマト(10)",null,"　にんじん(10)",null,"⑧鶏肉(10)",null,"　マッシュルーム(10)","　マッシュルーム(10)","　"]
[null,"　とうもろこし(10)",null,"　黄パプリカ(7)",null,"　ねぎ(5)",null,"　小松菜(8)",null,"　とうもろこし(5)","　とうもろこし(5)","　"]
[null,"⑩ベーコン(10)",null,"⑦枝豆(5)",null,"　とうもろこし(5)",null,"⑦油揚げ(3)",null,"　パセリ(0.05)","　パセリ(0.05)","　"]
[null,"　赤パプリカ(5)",null,"　しいたけ(0.5)",null,"　わかめ(0.3)",null,"⑦合わせみそ(9)",null,"◎牛乳(30)","⑦豆乳(30)","　"]
[null,"　野菜ブイヨン(1.5)",null,"　カレールウ\n　　　　[えがお](12)",null,"⑧⑩中華ガラスープの\n　　　　　　　素(3.5)",null,"　だし",null,"　ホワイトルウ\n　　　　　[えがお](5)","　ホワイトルウ\n　　　　[えがお](5)","　"]
[null,"　白ワイン(1)",null,"⑦⑩洋風だしの素(1.5)",null,"●⑦しょうゆ(1.2)",null,"",null,"◎チーズ(2)","⑦⑩洋風だしの素(1)","　"]
[null,"●⑦しょうゆ(2)",null,"　純カレー(0.3)",null,"　酒(1)",null,"",null,"⑦⑩洋風だしの素(1)","　塩(0.5)","　"]
[null,"　塩(0.1)",null,"　塩(0.3)",null,"　塩(0.1)",null,"",null,"　塩(0.5)","　こしょう(0.03)","　"]
[null,"　こしょう(0.02)",null,"　こしょう(0.02)",null,"　こしょう(0.03)",null,"",null,"　こしょう(0.03)",null,"　"]
[null,"",null,"　サラダ油(0.5)",null,"",null,"",null,"",null,"　"]
[null,"",null,"",null,"",null,"",null,"",null,"　"]
["フライ缶","【かぼちゃサンド\n　　　　　オムレツ】","【＊ホキフライ】","【サモサ】",null,"【切り干し大根入り\n　　　　チャプチェ】",null,"【まぐろの甘辛煮】",null,"【ハンバーグのサボテン\n　　　入りソースかけ】",null,"　"]
[null,"　かぼちゃサンド\n　　　オムレツ(41.6)","　米粉の\n　　　ホキフライ(40)","　サモサ(40)",null,"⑩豚肉(20)",null,"　まぐろ油漬け(45)",null,"　ハンバーグ(50)",null,"　"]
[null,"","　米油(4)","　米油(4)",null,"　たまねぎ(20)",null,"　キャベツ(12)",null,"　野菜ミックス(10)",null,"　"]
[null,"≪かぼちゃサンド\n　　　　オムレツ≫",null,"",null,"　にんじん(5)",null,"　しょうが(1)",null,"　うちわサボテン(3)",null,"　"]
[null,"○鶏卵",null,"≪サモサ≫",null,"　はるさめ(4)",null,"　砂糖(3)",null,"　ベジタブルソース\n　　　　　　　　(10)",null,"　"]
[null,"　かぼちゃ",null,"　じゃがいも",null,"　切り干し大根(3)",null,"●⑦しょうゆ(1.5)",null,"　トマトケチャップ(5)",null,"　"]
[null,"⑧鶏肉",null,"　さやいんげん",null,"　にんにく(0.1)",null,"　本みりん(1)",null,"　ソース(1)",null,"　"]
[null,"⑦調味料等",null,"　たまねぎ",null,"④白ごま(1)",null,"　酒(1)",null,"　砂糖(1)",null,"　"]
[null,"",null,"　にんじん",null,"●⑦しょうゆ(2.5)",null,"",null,"　赤ワイン(0.5)",null,"　"]
[null,"",null,"④白ごま",null,"　本みりん(1)",null,"",null,"　塩(0.1)",null,"　"]
[null,"",null,"●小麦粉",null,"　酒(1)",null,"",null,"",null,"　"]
[null,"",null,"　調味料等",null,"●⑦オイスターソース\n　　　　　　　　(0.8)",null,"",null,"≪野菜ミックス≫　",null,"　"]
[null,"",null,"",null,"　砂糖(0.5)",null,"",null,"   ズッキーニ",null,"　"]
[null,"",null,"　",null,"④ごま油(0.3)",null,"",null,"　黄ピーマン",null,"　"]
[null,null,null,null,null,null,null,null,null,"　赤ピーマン",null,"　"]
[null,null,null,null,null,null,null,null,null,"　たまねぎ",null,"　"]
[null,null,null,null,null,null,null,null,null,"　にんじん",null,"　"]
[null,null,null,null,null,null,null,null,null,"",null,"　"]
[null,null,null,null,null,null,null,null,null,"≪ベジタブルソース≫",null,"　"]
[null,null,null,null,null,null,null,null,null,"　トマト",null,"　"]
[null,null,null,null,null,null,null,null,null,"　たまねぎ",null,"　"]
[null,null,null,null,null,null,null,null,null,"⑦調味料等",null,"　"]
[null,"",null,"",null,"",null,"",null,null,null,"　"]
["あえ物・果物","",null,"【カチュンバル風サラダ】",null,"",null,"【きざみたくあん】",null,"",null,"　"]
[null,"",null,"　きゅうり(10)",null,"",null,"　たくあん漬け(13)",null,"　　≪ハンバーグ≫",null,"　"]
[null,"",null,"　ひよこ豆(10)",null,"",null,"",null,"　　⑧鶏肉",null,"　"]
[null,"",null,"　とうもろこし(5)",null,"",null,"≪たくあん漬け≫",null,"　　⑩豚肉",null,"　"]
[null,"",null,"　ドレッシング(2.8)",null,"",null,"　大根",null,"　　　たまねぎ",null,"　"]
[null,"",null,"　レモン果汁(0.2)",null,"",null,"●⑦調味料等",null,"　　⑩調味料等",null,"　"]
[null,"",null,"　一味唐辛子(0.01)",null,"",null,"",null,"",null,"　"]
[null,"",null,"",null,"",null,"",null,"",null,"　"]
["その他","【ケチャップ小袋】",null,"",null,"【いわしの干し小魚】",null,"【手巻きのり】",null,"【ブルーベリージャム】",null,"　"]
[null,"　トマトケチャップ(8)",null,"",null,"　いわしの干し小魚(5)",null,"　手巻きのり(2.5)",null,"　ブルーベリージャム(15)",null,"　"]
[null,"",null,"",null,"",null,"",null,"",null,"　"]
[null,"",null,"",null,"",null,"",null,"",null,"　"]
["　",null,null,null,null,null,null,null,null,null,"（　）内は純使用量　単位：グラム","　"]
["　",null,null,null,null,null,null,null,null,null,null,"　"]
["　",null,null,null,"小学校－３",null,null,null,null,null,null,"　"]
["日","2026-07-15",null,"2026-07-16",null,null,null,null,null,null,null,"　"]
["主食","ごはん",null,"ごはん",null,null,null,null,null,null,null,"　"]
["牛乳","◎牛乳",null,"◎牛乳",null,null,null,null,null,null,null,"　"]
[null,"通常給食","アレルギー給食\n(卵･乳･えび･かに除去)","通常給食","アレルギー給食\n(卵･乳･えび･かに除去)",null,null,null,null,null,null,"　"]
["食缶","【大根と豚肉の煮物】",null,"【もずく汁】",null,null,"※　アレルギー物質の19品目について、次のように表示しています。",null,null,null,null,"　"]
[null,"　大根(55)",null,"⑧鶏肉(20)",null,"　","○…卵","◎…乳","●…小麦","△…えび","▲…かに","　"]
[null,"　さといも(35)",null,"⑫ながいも(15)",null,"　","①…いか","②…オレンジ","③…牛肉","④…ごま","⑤…さけ","　"]
[null,"⑩豚肉(20)",null,"　にんじん(10)",null,"　","⑥…さば","⑦…大豆","⑧…鶏肉","⑨…バナナ","⑩…豚肉","　"]
[null,"⑦生揚げ(25)",null,"　かまぼこ(10)",null,"　","⑪…もも","⑫…やまいも","⑬…りんご","⑭…ゼラチン",null,"　"]
[null,"　にんじん(20)",null,"　えのきたけ(10)",null,null,"１　パンに表示される⑦大豆については、油、乳化剤（大豆由来）のアレルゲンを示します。",null,null,null,null,"　"]
[null,"　昆布(0.5)",null,"　ねぎ(10)",null,null,"２　アレルギー献立表の見方については、「保存版ＮＯ．１」を参照してください。",null,null,null,null,"　"]
[null,"●⑦しょうゆ(5)",null,"　もずく(10)",null,null,"３　「むろ削り」または「和風だしの素」については、「だし」と表記しています。",null,null,null,null,"　"]
[null,"　砂糖(2.5)",null,"　しょうが(0.5)",null,null,null,null,null,null,null,"　"]
[null,"　酒(2)",null,"●⑦しょうゆ(4)",null,null,null,null,null,null,null,"　"]
[null,"　本みりん(1)",null,"　酒(1)",null,null,null,null,null,null,null,"　"]
[null,"　だし",null,"　塩(0.05)",null,null,null,null,null,null,null,"　"]
[null,"",null,"　だし",null,null,null,null,null,null,null,"　"]
[null,"",null,"",null,null,null,null,null,null,null,"　"]
["フライ缶","【ちくわの\n　　　　いそべ揚げ】",null,"【ゴーヤ\n　　　チャンプルー】","【＊ゴーヤ\n　　　チャンプルー】",null,null,null,null,null,null,"　"]
[null,"　焼きちくわ(40)",null,"⑦生揚げ(25)","⑦生揚げ(35)",null,"※　春日井市食育推進給食会ホームページに、当市が表示するアレルゲン19品目",null,null,null,null,"　"]
[null,"●小麦粉(3)",null,"○炒り卵(20)","　ゴーヤ(15)",null,"　 のアレルギーマークを検索して強調表示する機能を持つ「マーク強調機能付",null,null,null,null,"　"]
[null,"　でん粉(1)",null,"　ゴーヤ(15)","⑩豚肉(25)",null,"　 アレルギー献立表」を掲載しています。",null,null,null,null,"　"]
[null,"　青のり粉(0.12)",null,"⑩豚肉(15)","●⑦しょうゆ(2)",null,"　　　https://www.kasugai-kyushoku.com/kondatehyou/allergy_mark/",null,null,null,null,"　"]
[null,"　米油(4.41)",null,"●⑦しょうゆ(2)","　砂糖(2)",null,null,null,null,null,null,"　"]
[null,"",null,"　砂糖(2)","⑦⑧⑩中華だしの素\n　　　　　　　(0.5)",null,null,null,null,null,null,"　"]
[null,"",null,"⑦⑧⑩中華だしの素\n　　　　　　　(0.5)","　米油(0.3)",null,null,null,null,null,null,"　"]
[null,"",null,"　米油(0.3)","　塩(0.1)",null,null,null,null,null,null,"　"]
[null,"",null,"　塩(0.1)","　こしょう(0.03)",null,null,null,null,null,null,"　"]
[null,"",null,"　こしょう(0.03)",null,null,null,null,null,null,null,"　"]
[null,"",null,null,null,null,null,null,null,null,null,"　"]
[null,"",null,"",null,null,null,null,null,null,null,"　"]
["あえ物・果物","【キャベツのゆかり和え】",null,"",null,null,null,null,null,null,null,"　"]
[null,"　キャベツ(25)",null,"",null,null,null,null,null,null,null,"　"]
[null,"　ゆかり粉(0.5)",null,"",null,null,null,null,null,null,null,"　"]
[null,null,null,null,null,null,null,null,null,null,null,"　"]
[null,"",null,"",null,null,null,null,null,null,null,"　"]
["その他","",null,"【セレクトデザート】",null,null,null,null,null,null,null,"　"]
[null,"",null,"⑦米粉シークワーサータルト(25)",null,null,null,null,null,null,null,"　"]
[null,"",null,"⑪ピーチゼリー(70)",null,null,null,null,null,null,null,"　"]
[null,"",null,"",null,null,null,null,null,null,null,"　"]
["　",null,null,null,"（　）内は純使用量　単位：グラム",null,null,null,null,null,null,"　"]

{"sheet":"対象者","index":1,"n_rows":101,"n_cols":21,"rows_kept":101,"cut":false,"hidden":true,"merged":[]}
["番号","学校","学年","組","氏名","アレ１","１記号","アレ２","２記号","アレ３","３記号","アレ４","４記号","アレ５","５記号","アレ６","６記号","アレ７","７記号",1,"アレルゲンはドロップダウンリストから選択してください。"]
[1,null,null,null,null,null,"---",null,"---",null,"---",null,"---",null,"---",null,"---",null,"---",2,"アレルギー献立表に表示可能なアレルゲンは５種類までとなります。※６、７は参考入力"]
[2,null,null,null,null,null,"---",null,"---",null,"---",null,"---",null,"---",null,"---",null,"---","※","５種類を超えるアレルゲンのある場合は、弁当持参を促すべき児童生徒と言えます。"]
[3,null,null,null,null,null,"---",null,"---",null,"---",null,"---",null,"---",null,"---",null,"---",3,"このリストをアレルギー献立表の「対象者」シートにコピーして「値のみ」を貼り付けてください。"]
[4,null,null,null,null,null,"---",null,"---",null,"---",null,"---",null,"---",null,"---",null,"---",4,"対象者を100人以上登録したいときは、A100～R101を選択してコピー（又はオートフィル）してください。"]
[5,null,null,null,null,null,"---",null,"---",null,"---",null,"---",null,"---",null,"---",null,"---"]
[6,null,null,null,null,null,"---",null,"---",null,"---",null,"---",null,"---",null,"---",null,"---"]
[7,null,null,null,null,null,"---",null,"---",null,"---",null,"---",null,"---",null,"---",null,"---"]
[8,null,null,null,null,null,"---",null,"---",null,"---",null,"---",null,"---",null,"---",null,"---"]
[9,null,null,null,null,null,"---",null,"---",null,"---",null,"---",null,"---",null,"---",null,"---"]
[10,null,null,null,null,null,"---",null,"---",null,"---",null,"---",null,"---",null,"---",null,"---"]
[11,null,null,null,null,null,"---",null,"---",null,"---",null,"---",null,"---",null,"---",null,"---"]
[12,null,null,null,null,null,"---",null,"---",null,"---",null,"---",null,"---",null,"---",null,"---"]
[13,null,null,null,null,null,"---",null,"---",null,"---",null,"---",null,"---",null,"---",null,"---"]
[14,null,null,null,null,null,"---",null,"---",null,"---",null,"---",null,"---",null,"---",null,"---"]
[15,null,null,null,null,null,"---",null,"---",null,"---",null,"---",null,"---",null,"---",null,"---"]
[16,null,null,null,null,null,"---",null,"---",null,"---",null,"---",null,"---",null,"---",null,"---"]
[17,null,null,null,null,null,"---",null,"---",null,"---",null,"---",null,"---",null,"---",null,"---"]
[18,null,null,null,null,null,"---",null,"---",null,"---",null,"---",null,"---",null,"---",null,"---"]
[19,null,null,null,null,null,"---",null,"---",null,"---",null,"---",null,"---",null,"---",null,"---"]
[20,null,null,null,null,null,"---",null,"---",null,"---",null,"---",null,"---",null,"---",null,"---"]
[21,null,null,null,null,null,"---",null,"---",null,"---",null,"---",null,"---",null,"---",null,"---"]
[22,null,null,null,null,null,"---",null,"---",null,"---",null,"---",null,"---",null,"---",null,"---"]
[23,null,null,null,null,null,"---",null,"---",null,"---",null,"---",null,"---",null,"---",null,"---"]
[24,null,null,null,null,null,"---",null,"---",null,"---",null,"---",null,"---",null,"---",null,"---"]
[25,null,null,null,null,null,"---",null,"---",null,"---",null,"---",null,"---",null,"---",null,"---"]
[26,null,null,null,null,null,"---",null,"---",null,"---",null,"---",null,"---",null,"---",null,"---"]
[27,null,null,null,null,null,"---",null,"---",null,"---",null,"---",null,"---",null,"---",null,"---"]
[28,null,null,null,null,null,"---",null,"---",null,"---",null,"---",null,"---",null,"---",null,"---"]
[29,null,null,null,null,null,"---",null,"---",null,"---",null,"---",null,"---",null,"---",null,"---"]
[30,null,null,null,null,null,"---",null,"---",null,"---",null,"---",null,"---",null,"---",null,"---"]
[31,null,null,null,null,null,"---",null,"---",null,"---",null,"---",null,"---",null,"---",null,"---"]
[32,null,null,null,null,null,"---",null,"---",null,"---",null,"---",null,"---",null,"---",null,"---"]
[33,null,null,null,null,null,"---",null,"---",null,"---",null,"---",null,"---",null,"---",null,"---"]
[34,null,null,null,null,null,"---",null,"---",null,"---",null,"---",null,"---",null,"---",null,"---"]
[35,null,null,null,null,null,"---",null,"---",null,"---",null,"---",null,"---",null,"---",null,"---"]
[36,null,null,null,null,null,"---",null,"---",null,"---",null,"---",null,"---",null,"---",null,"---"]
[37,null,null,null,null,null,"---",null,"---",null,"---",null,"---",null,"---",null,"---",null,"---"]
[38,null,null,null,null,null,"---",null,"---",null,"---",null,"---",null,"---",null,"---",null,"---"]
[39,null,null,null,null,null,"---",null,"---",null,"---",null,"---",null,"---",null,"---",null,"---"]
[40,null,null,null,null,null,"---",null,"---",null,"---",null,"---",null,"---",null,"---",null,"---"]
[41,null,null,null,null,null,"---",null,"---",null,"---",null,"---",null,"---",null,"---",null,"---"]
[42,null,null,null,null,null,"---",null,"---",null,"---",null,"---",null,"---",null,"---",null,"---"]
[43,null,null,null,null,null,"---",null,"---",null,"---",null,"---",null,"---",null,"---",null,"---"]
[44,null,null,null,null,null,"---",null,"---",null,"---",null,"---",null,"---",null,"---",null,"---"]
[45,null,null,null,null,null,"---",null,"---",null,"---",null,"---",null,"---",null,"---",null,"---"]
[46,null,null,null,null,null,"---",null,"---",null,"---",null,"---",null,"---",null,"---",null,"---"]
[47,null,null,null,null,null,"---",null,"---",null,"---",null,"---",null,"---",null,"---",null,"---"]
[48,null,null,null,null,null,"---",null,"---",null,"---",null,"---",null,"---",null,"---",null,"---"]
[49,null,null,null,null,null,"---",null,"---",null,"---",null,"---",null,"---",null,"---",null,"---"]
[50,null,null,null,null,null,"---",null,"---",null,"---",null,"---",null,"---",null,"---",null,"---"]
[51,null,null,null,null,null,"---",null,"---",null,"---",null,"---",null,"---",null,"---",null,"---"]
[52,null,null,null,null,null,"---",null,"---",null,"---",null,"---",null,"---",null,"---",null,"---"]
[53,null,null,null,null,null,"---",null,"---",null,"---",null,"---",null,"---",null,"---",null,"---"]
[54,null,null,null,null,null,"---",null,"---",null,"---",null,"---",null,"---",null,"---",null,"---"]
[55,null,null,null,null,null,"---",null,"---",null,"---",null,"---",null,"---",null,"---",null,"---"]
[56,null,null,null,null,null,"---",null,"---",null,"---",null,"---",null,"---",null,"---",null,"---"]
[57,null,null,null,null,null,"---",null,"---",null,"---",null,"---",null,"---",null,"---",null,"---"]
[58,null,null,null,null,null,"---",null,"---",null,"---",null,"---",null,"---",null,"---",null,"---"]
[59,null,null,null,null,null,"---",null,"---",null,"---",null,"---",null,"---",null,"---",null,"---"]
[60,null,null,null,null,null,"---",null,"---",null,"---",null,"---",null,"---",null,"---",null,"---"]
[61,null,null,null,null,null,"---",null,"---",null,"---",null,"---",null,"---",null,"---",null,"---"]
[62,null,null,null,null,null,"---",null,"---",null,"---",null,"---",null,"---",null,"---",null,"---"]
[63,null,null,null,null,null,"---",null,"---",null,"---",null,"---",null,"---",null,"---",null,"---"]
[64,null,null,null,null,null,"---",null,"---",null,"---",null,"---",null,"---",null,"---",null,"---"]
[65,null,null,null,null,null,"---",null,"---",null,"---",null,"---",null,"---",null,"---",null,"---"]
[66,null,null,null,null,null,"---",null,"---",null,"---",null,"---",null,"---",null,"---",null,"---"]
[67,null,null,null,null,null,"---",null,"---",null,"---",null,"---",null,"---",null,"---",null,"---"]
[68,null,null,null,null,null,"---",null,"---",null,"---",null,"---",null,"---",null,"---",null,"---"]
[69,null,null,null,null,null,"---",null,"---",null,"---",null,"---",null,"---",null,"---",null,"---"]
[70,null,null,null,null,null,"---",null,"---",null,"---",null,"---",null,"---",null,"---",null,"---"]
[71,null,null,null,null,null,"---",null,"---",null,"---",null,"---",null,"---",null,"---",null,"---"]
[72,null,null,null,null,null,"---",null,"---",null,"---",null,"---",null,"---",null,"---",null,"---"]
[73,null,null,null,null,null,"---",null,"---",null,"---",null,"---",null,"---",null,"---",null,"---"]
[74,null,null,null,null,null,"---",null,"---",null,"---",null,"---",null,"---",null,"---",null,"---"]
[75,null,null,null,null,null,"---",null,"---",null,"---",null,"---",null,"---",null,"---",null,"---"]
[76,null,null,null,null,null,"---",null,"---",null,"---",null,"---",null,"---",null,"---",null,"---"]
[77,null,null,null,null,null,"---",null,"---",null,"---",null,"---",null,"---",null,"---",null,"---"]
[78,null,null,null,null,null,"---",null,"---",null,"---",null,"---",null,"---",null,"---",null,"---"]
[79,null,null,null,null,null,"---",null,"---",null,"---",null,"---",null,"---",null,"---",null,"---"]
[80,null,null,null,null,null,"---",null,"---",null,"---",null,"---",null,"---",null,"---",null,"---"]
[81,null,null,null,null,null,"---",null,"---",null,"---",null,"---",null,"---",null,"---",null,"---"]
[82,null,null,null,null,null,"---",null,"---",null,"---",null,"---",null,"---",null,"---",null,"---"]
[83,null,null,null,null,null,"---",null,"---",null,"---",null,"---",null,"---",null,"---",null,"---"]
[84,null,null,null,null,null,"---",null,"---",null,"---",null,"---",null,"---",null,"---",null,"---"]
[85,null,null,null,null,null,"---",null,"---",null,"---",null,"---",null,"---",null,"---",null,"---"]
[86,null,null,null,null,null,"---",null,"---",null,"---",null,"---",null,"---",null,"---",null,"---"]
[87,null,null,null,null,null,"---",null,"---",null,"---",null,"---",null,"---",null,"---",null,"---"]
[88,null,null,null,null,null,"---",null,"---",null,"---",null,"---",null,"---",null,"---",null,"---"]
[89,null,null,null,null,null,"---",null,"---",null,"---",null,"---",null,"---",null,"---",null,"---"]
[90,null,null,null,null,null,"---",null,"---",null,"---",null,"---",null,"---",null,"---",null,"---"]
[91,null,null,null,null,null,"---",null,"---",null,"---",null,"---",null,"---",null,"---",null,"---"]
[92,null,null,null,null,null,"---",null,"---",null,"---",null,"---",null,"---",null,"---",null,"---"]
[93,null,null,null,null,null,"---",null,"---",null,"---",null,"---",null,"---",null,"---",null,"---"]
[94,null,null,null,null,null,"---",null,"---",null,"---",null,"---",null,"---",null,"---",null,"---"]
[95,null,null,null,null,null,"---",null,"---",null,"---",null,"---",null,"---",null,"---",null,"---"]
[96,null,null,null,null,null,"---",null,"---",null,"---",null,"---",null,"---",null,"---",null,"---"]
[97,null,null,null,null,null,"---",null,"---",null,"---",null,"---",null,"---",null,"---",null,"---"]
[98,null,null,null,null,null,"---",null,"---",null,"---",null,"---",null,"---",null,"---",null,"---"]
[99,null,null,null,null,null,"---",null,"---",null,"---",null,"---",null,"---",null,"---",null,"---"]
[100,null,null,null,null,null,"---",null,"---",null,"---",null,"---",null,"---",null,"---",null,"---"]

{"sheet":"アレルゲン","index":2,"n_rows":5,"n_cols":4,"rows_kept":5,"cut":false,"hidden":true,"merged":[]}
[1,{"$f":"VLOOKUP(D$1,対象者!$A:$S,7,FALSE)","v":{"$error":"#N/A"}},"個人番号",{"$f":"'アレルギー献立表（小学校）'!M3","v":0}]
[2,{"$f":"VLOOKUP(D$1,対象者!$A:$S,9,FALSE)","v":{"$error":"#N/A"}}]
[3,{"$f":"VLOOKUP(D$1,対象者!$A:$S,11,FALSE)","v":{"$error":"#N/A"}}]
[4,{"$f":"VLOOKUP(D$1,対象者!$A:$S,13,FALSE)","v":{"$error":"#N/A"}}]
[5,{"$f":"VLOOKUP(D$1,対象者!$A:$S,15,FALSE)","v":{"$error":"#N/A"}}]