{"text_format":"1","workbook":"xlsx","n_sheets":3,"sheets":["アレルギー献立表（中学校）","対象者","アレルゲン"],"not_rendered":{"charts":0,"images":1,"macros":1,"external_links":0,"defined_names":1,"comments":0,"pivot_tables":0},"unopened":[],"bounds":{"document_bytes":16777216,"sheet_cells":100000,"rows_first":2000,"rows_last":500,"rows_between":2000,"halvings":0,"cell_chars":16384,"cell_head_chars":4096},"cells_cut":0,"cells_raw":0,"read":"whole","date_system":"1900"}

{"sheet":"アレルギー献立表（中学校）","index":0,"n_rows":154,"n_cols":13,"rows_kept":154,"cut":false,"hidden":false,"merged":[[5,1,5,2],[113,3,113,4],[149,0,152,0],[9,0,25,0],[26,0,40,0],[41,0,50,0],[51,0,54,0],[62,0,77,0],[78,0,99,0],[100,0,106,0],[107,0,109,0],[117,0,130,0],[131,0,143,0],[144,0,148,0]]}
[null,{"$f":"CONCATENATE(IFERROR(VLOOKUP($M$3,対象者!$A:$O,2,FALSE),\"\"),DBCS(IFERROR(VLOOKUP($M$3,対象者!$A:$O,3,FALSE),\"\")),IFERROR(IF($M$3=\"\",\"\",\"年\"),\"\"))","v":""},{"$f":"IFERROR(VLOOKUP($M$3,対象者!$A:$O,4,FALSE),\"\")","v":""},{"$f":"IFERROR(VLOOKUP($M$3,対象者!$A:$O,5,FALSE),\"\")","v":""},null,null,null,null,null,null,null,"　"]
[null,{"$f":"CONCATENATE(IFERROR(VLOOKUP($M$3,対象者!$A:$O,6,FALSE),\"\"),\" \",IFERROR(VLOOKUP($M$3,対象者!$A:$O,7,FALSE),\"\"))","v":" "},{"$f":"CONCATENATE(IFERROR(VLOOKUP($M$3,対象者!$A:$O,8,FALSE),\"\"),\" \",IFERROR(VLOOKUP($M$3,対象者!$A:$O,9,FALSE),\"\"))","v":" "},{"$f":"CONCATENATE(IFERROR(VLOOKUP($M$3,対象者!$A:$O,10,FALSE),\"\"),\" \",IFERROR(VLOOKUP($M$3,対象者!$A:$O,11,FALSE),\"\"))","v":" "},{"$f":"CONCATENATE(IFERROR(VLOOKUP($M$3,対象者!$A:$O,12,FALSE),\"\"),\" \",IFERROR(VLOOKUP($M$3,対象者!$A:$O,13,FALSE),\"\"))","v":" "},{"$f":"CONCATENATE(IFERROR(VLOOKUP($M$3,対象者!$A:$O,14,FALSE),\"\"),\" \",IFERROR(VLOOKUP($M$3,対象者!$A:$O,15,FALSE),\"\"))","v":" "},null,null,null,null,null,"　","番号"]
["　","令和8年度　7月アレルギー献立表（通常献立、アレルギー給食献立）",null,null,null,null,null,null,null,null,"中学校－１","　"]
[null,"１　通常給食を食べている人（一部を無配膳対応としている人を含む）は、「通常給食」欄を確認してください。",null,null,null,null,null,null,null,null,null,"　"]
[null,"２　アレルギー給食（卵･乳･えび･かにを除去した給食）を食べている人は、「アレルギー給食」欄を確認してください。ただし、通常給食とアレルギー給食の献立内容が同じ場合は、アレルギー給食の欄は空欄としています。",null,null,null,null,null,null,null,null,null,"　"]
["日","2026-07-01",null,"2026-07-02",null,"2026-07-03",null,"2026-07-06",null,"2026-07-07",null,"　"]
["主食","わかめごはん",null,"ごはん",null,"◎●⑦ミルクロールパン",null,"麦ごはん",null,"麦ごはん",null,"　"]
["牛乳","◎牛乳",null,"◎牛乳",null,"◎牛乳",null,"◎牛乳",null,"◎牛乳",null,"　"]
[null,"通常給食","アレルギー給食\n(卵･乳･えび･かに除去)","通常給食","アレルギー給食\n(卵･乳･えび･かに除去)","通常給食","アレルギー給食\n(卵･乳･えび･かに除去)","通常給食","アレルギー給食\n(卵･乳･えび･かに除去)","通常給食","アレルギー給食\n(卵･乳･えび･かに除去)","　"]
["食缶","【かきたま汁】","【*すまし汁】","【スタミナ肉じゃが】",null,"【大豆のインド煮】",null,"【わかめスープ】",null,"【七夕汁】",null,"　"]
[null,"⑦豆腐(32.5)","⑦豆腐(39)","　じゃがいも(117)",null,"　たまねぎ(91)",null,"　たまねぎ(32.5)",null,"　大根(26)",null,"　"]
[null,"○液卵(26)","　たまねぎ(26)","　たまねぎ(52)",null,"⑦大豆(52)",null,"⑦豆腐(32.5)",null,"⑧鶏肉(19.5)",null,"　"]
[null,"　たまねぎ(19.5)","⑧鶏肉(13)","　しらたき(32.5)",null,"　にんじん(32.5)",null,"⑧鶏肉(13)",null,"　にんじん(13)",null,"　"]
[null,"⑧鶏肉(13)","　かまぼこ(19.5)","⑩豚肉(19.5)",null,"⑩豚肉(23.4)",null,"　にんじん(13)",null,"　オクラ(10.4)",null,"　"]
[null,"　かまぼこ(13)","　にんじん(13)","　にんじん(26)",null,"　トマトピューレ(7.8)",null,"　ねぎ(7.8)",null,"　ねぎ(6.5)",null,"　"]
[null,"　にんじん(6.5)","　えのきたけ(6.5)","④白ごま(2.6)",null,"　マッシュルーム(7.8)",null,"　とうもろこし(6.5)",null,"●サボテンきしめん\n　　　　　　　(6.5)",null,"　"]
[null,"　えのきたけ(6.5)","　ねぎ(6.5)","　にんにく(0.39)",null,"　カレールウ\n　　　　[えがお](6.24)",null,"　わかめ(0.65)",null,"　星型かまぼこ(6.5)",null,"　"]
[null,"　ねぎ(6.5)","●⑦しょうゆ(5.2)","●⑦しょうゆ(5.2)",null,"　ソース(3.12)",null,"⑧チキンブイヨン(26)",null,"　しいたけ(1.3)",null,"　"]
[null,"●⑦しょうゆ(5.2)","　塩(0.39)","　砂糖(3.25)",null,"⑦⑩洋風だしの素(1.56)",null,"●⑦しょうゆ(3.25)",null,"●⑦しょうゆ(5.2)",null,"　"]
[null,"　塩(0.39)","　でん粉(1.3)","⑦コチジャン(1.3)",null,"　純カレー(0.55)",null,"④白ごま(1.3)",null,"　塩(0.26)",null,"　"]
[null,"　でん粉(1.3)","　だし","　本みりん(1.3)",null,"　塩(0.31)",null,"⑦⑧⑩中華だしの素\n　　　　　　　(1.3)",null,"　だし",null,"　"]
[null,"　だし",null,"④ごま油(0.65)",null,"　こしょう(0.03)",null,"　塩(0.52)",null,"",null,"　"]
[null,"",null,"　塩(0.26)",null,"",null,"④ごま油(0.13)",null,"",null,"　"]
[null,"",null,"　豆板醤(0.13)",null,"",null,"　こしょう(0.04)",null,"",null,"　"]
[null,"",null,"　こしょう(0.04)",null,"",null,"",null,"",null,"　"]
[null,"",null,"",null,"",null,"",null,"",null,"　"]
["フライ缶","【枝豆コロッケ】",null,"【さば銀紙焼き】",null,"【フルーツの\n　　　　ゼリーあえ】",null,"【肉団子の甘酢あん】",null,"【なす入り肉みそ\n　　　ひじき丼の具】",null,"　"]
[null,"　枝豆コロッケ(60)",null,"　さば銀紙焼き(60)",null,"　いちごダイスゼリー\n　　　　　　　　(26)",null,"　肉団子(52)",null,"　たまねぎ(39)",null,"　"]
[null,"　米油(6)",null,"",null,"　みかんカットゼリー\n　　　　　　　　(26)",null,"　米油(5.2)",null,"⑩豚肉(39)",null,"　"]
[null,"",null,"≪さば銀紙焼き≫",null,"⑪黄桃(26)",null,"　たまねぎ(13)",null,"　なす(13)",null,"　"]
[null,"≪枝豆コロッケ≫",null,"⑥さば",null,"　パイナップル(26)",null,"　にんじん(13)",null,"　にんじん(10.4)",null,"　"]
[null,"⑦枝豆",null,"⑦調味料等",null,"",null,"　黄パプリカ(6.5)",null,"⑦枝豆(13)",null,"　"]
[null,"　じゃがいも",null,"",null,"",null,"　砂糖(1.95)",null,"　米ひじき(1.95)",null,"　"]
[null,"●パン粉",null,"",null,"",null,"　トマトケチャップ\n　　　　　　　(3.9)",null,"　しょうが(1.3)",null,"　"]
[null,"●小麦粉",null,"",null,"",null,"●⑦しょうゆ(1.95)",null,"⑦豆みそ(5.2)",null,"　"]
[null,"⑦植物性たん白",null,"",null,"",null,"　米酢(1.3)",null,"　砂糖(3.25)",null,"　"]
[null,"　調味料等",null,"",null,"",null,"　でん粉(0.65)",null,"　酒(2.6)",null,"　"]
[null,"",null,"",null,"",null,"",null,"　本みりん(1.95)",null,"　"]
[null,"",null,"",null,"",null,null,null,"●⑦しょうゆ(1.3)",null,"　"]
[null,"",null,"",null,"",null,"",null,"　でん粉(0.65)",null,"　"]
[null,"",null,"",null,"",null,"",null,"",null,"　"]
["あえ物・果物","【きゅうりの塩昆布あえ】",null,"",null,"",null,"",null,"",null,"　"]
[null,"　きゅうり(32.5)",null,"",null,"",null,"　≪肉団子≫",null,"",null,"　"]
[null,"　にんじん(3.9)",null,"",null,"",null,"　⑧鶏肉",null,"",null,"　"]
[null,"　塩昆布(1.56)",null,"",null,"",null,"　　たまねぎ",null,"",null,"　"]
[null,null,null,null,null,null,null,"　●パン粉",null,null,null,"　"]
[null,"《塩昆布》",null,null,null,null,null,"　⑩豚肉",null,null,null,"　"]
[null,"　昆布",null,null,null,null,null,"　⑦粒状大豆たん白",null,null,null,"　"]
[null,"●⑦調味料等",null,null,null,null,null,"　⑦粉末状大豆たん白",null,null,null,"　"]
[null,null,null,null,null,null,null,"　●⑦調味料等",null,null,null,"　"]
[null,"",null,"",null,"",null,"",null,"",null,"　"]
["その他","",null,"【フローズンヨーグルト】",null,"",null,"",null,"【バナナチップス】",null,"　"]
[null,"",null,"◎ヨーグルト(60)",null,"",null,"",null,"⑨バナナチップス(10)",null,"　"]
[null,"",null,"",null,"",null,"",null,"",null,"　"]
[null,"",null,"",null,"",null,"",null,"",null,"　"]
["　",null,null,null,null,null,null,null,null,null,"（　）内は純使用量　単位：グラム","　"]
["　",null,null,null,null,null,null,null,null,null,null,"　"]
["　",null,null,null,null,null,null,null,null,null,"中学校－２","　"]
["日","2026-07-08",null,"2026-07-09",null,"2026-07-10",null,"2026-07-13",null,"2026-07-14",null,"　"]
["主食","◎●⑦ツイストロールパン",null,"ごはん",null,"麦ごはん",null,"麦ごはん",null,"◎●⑦スライスパン",null,"　"]
["牛乳","◎牛乳",null,"◎牛乳",null,"◎はっこう乳",null,"◎牛乳",null,"◎牛乳",null,"　"]
[null,"通常給食","アレルギー給食\n(卵･乳･えび･かに除去)","通常給食","アレルギー給食\n(卵･乳･えび･かに除去)","通常給食","アレルギー給食\n(卵･乳･えび･かに除去)","通常給食","アレルギー給食\n(卵･乳･えび･かに除去)","通常給食","アレルギー給食\n(卵･乳･えび･かに除去)","　"]
["食缶","【夏野菜のスープ煮】",null,"【キムチ入り\n　　トッポギスープ】",null,"【キーマカレー】",null,"【かぼちゃ入り\n　　　　　みそ汁】",null,"【クリームコーン\n　　　　　　スープ】","【＊クリームコーン\n　　　　　　スープ】","　"]
[null,"　じゃがいも(39)",null,"　たまねぎ(32.5)",null,"　たまねぎ(78)",null,"　おじゃがもちボール\n　　　　かぼちゃ(26)",null,"　たまねぎ(52)","　たまねぎ(52)","　"]
[null,"　キャベツ(52)",null,"　トッポギ(26)",null,"⑩豚肉(39)",null,"⑦豆腐(26)",null,"　クリームコーン(32.5)","　クリームコーン(32.5)","　"]
[null,"　たまねぎ(39)",null,"⑧鶏肉(19.5)",null,"　にんじん(26)",null,"　かぼちゃ(19.5)",null,"⑧鶏肉(26)","⑧鶏肉(26)","　"]
[null,"　にんじん(26)",null,"　キムチ(13)",null,"⑦大豆(19.5)",null,"　大根(13)",null,"　にんじん(26)","　にんじん(26)","　"]
[null,"　ズッキーニ(13)",null,"　にんじん(13)",null,"　トマト(13)",null,"⑧鶏肉(13)",null,"　マッシュルーム(13)","　マッシュルーム(13)","　"]
[null,"　とうもろこし(13)",null,"　ねぎ(6.5)",null,"　黄パプリカ(9.1)",null,"　小松菜(10.4)",null,"　とうもろこし(6.5)","　とうもろこし(6.5)","　"]
[null,"⑩ベーコン(13)",null,"　とうもろこし(6.5)",null,"⑦枝豆(6.5)",null,"⑦油揚げ(3.9)",null,"　パセリ(0.06)","　パセリ(0.06)","　"]
[null,"　赤パプリカ(6.5)",null,"　わかめ(0.39)",null,"　しいたけ(0.65)",null,"⑦合わせみそ(11.7)",null,"◎牛乳(39)","⑦豆乳(39)","　"]
[null,"　野菜ブイヨン(1.95)",null,"⑧⑩中華ガラスープの\n　　　　　　　素(4.55)",null,"　カレールウ\n　　　　[えがお](15.6)",null,"　だし",null,"　ホワイトルウ\n　　　　[えがお](6.5)","　ホワイトルウ\n　　　　[えがお](6.5)","　"]
[null,"　白ワイン(1.3)",null,"●⑦しょうゆ(1.56)",null,"⑦⑩洋風だしの素(1.95)",null,"",null,"◎チーズ(2.6)","⑦⑩洋風だしの素(1.3)","　"]
[null,"●⑦しょうゆ(2.6)",null,"　酒(1.3)",null,"　純カレー(0.39)",null,"",null,"⑦⑩洋風だしの素(1.3)","　塩(0.65)","　"]
[null,"　塩(0.13)",null,"　塩(0.13)",null,"　塩(0.39)",null,"",null,"　塩(0.65)","　こしょう(0.04)","　"]
[null,"　こしょう(0.03)",null,"　こしょう(0.04)",null,"　こしょう(0.03)",null,"",null,"　こしょう(0.04)",null,"　"]
[null,"",null,"",null,"　サラダ油(0.65)",null,"",null,"",null,"　"]
[null,"",null,"",null,"",null,"",null,"",null,"　"]
["フライ缶","【かぼちゃサンド\n　　　　　オムレツ】","【＊ホキフライ】","【切り干し大根入り\n　　　　チャプチェ】",null,"【サモサ】",null,"【まぐろの甘辛煮】",null,"【ハンバーグのサボテン\n　　　入りソースかけ】",null,"　"]
[null,"　かぼちゃサンド\n　　　　オムレツ(50)","　米粉の\n　　　ホキフライ(50)","⑩豚肉(26)",null,"　サモサ(50)",null,"　まぐろ油漬け(58.5)",null,"　ハンバーグ(60)",null,"　"]
[null,"","　米油(5)","　たまねぎ(26)",null,"　米油(5)",null,"　キャベツ(15.6)",null,"　野菜ミックス(13)",null,"　"]
[null,"≪かぼちゃサンド\n　　　　オムレツ≫",null,"　にんじん(6.5)",null,"",null,"　しょうが(1.3)",null,"　うちわサボテン(3.9)",null,"　"]
[null,"○鶏卵",null,"　はるさめ(5.2)",null,"≪サモサ≫",null,"　砂糖(3.9)",null,"　ベジタブルソース\n                      (13)",null,"　"]
[null,"　かぼちゃ",null,"　切り干し大根(3.9)",null,"　じゃがいも",null,"●⑦しょうゆ(1.95)",null,"　トマトケチャップ\n                      (6.5)",null,"　"]
[null,"⑧鶏肉",null,"　にんにく(0.13)",null,"　さやいんげん",null,"　本みりん(1.3)",null,"　ソース(1.3)",null,"　"]
[null,"⑦調味料等",null,"④白ごま(1.3)",null,"　たまねぎ",null,"　酒(1.3)",null,"　砂糖(1.3)",null,"　"]
[null,"",null,"●⑦しょうゆ(3.25)",null,"　にんじん",null,"",null,"　赤ワイン(0.65)",null,"　"]
[null,"",null,"　本みりん(1.3)",null,"④白ごま",null,"",null,"　塩(0.13)",null,"　"]
[null,null,null,"　酒(1.3)",null,"●小麦粉",null,null,null,null,null,"　"]
[null,null,null,"●⑦オイスターソース\n　　　　　　　　(1.04)",null,"　調味料等",null,null,null,"≪野菜ミックス≫　",null,"　"]
[null,null,null,"　砂糖(0.65)",null,null,null,null,null,"   ズッキーニ",null,"　"]
[null,null,null,"④ごま油(0.39)",null,null,null,null,null,"　黄ピーマン",null,"　"]
[null,null,null,null,null,null,null,null,null,"　赤ピーマン",null,"　"]
[null,null,null,null,null,null,null,null,null,"　たまねぎ",null,"　"]
[null,null,null,null,null,null,null,null,null,"　にんじん",null,"　"]
[null,"",null,null,null,"",null,"",null,"",null,"　"]
[null,"",null,null,null,"",null,"",null,"≪ベジタブルソース≫",null,"　"]
[null,"",null,null,null,"",null,"",null,"　トマト",null,"　"]
[null,"",null,null,null,"",null,"",null,"　たまねぎ",null,"　"]
[null,"",null,"",null,"",null,"",null,"⑦調味料等",null,"　"]
["あえ物・果物","",null,"",null,"【カチュンバル風サラダ】",null,"【きざみたくあん】",null,"",null,"　"]
[null,"",null,"",null,"　きゅうり(13)",null,"　たくあん漬け(16.9)",null,"　　≪ハンバーグ≫",null,"　"]
[null,"",null,"",null,"　ひよこ豆(13)",null,"",null,"　　⑧鶏肉",null,"　"]
[null,"",null,"",null,"　とうもろこし(6.5)",null,"≪たくあん漬け≫",null,"　　⑩豚肉",null,"　"]
[null,"",null,"",null,"　ドレッシング(3.6)",null,"　大根",null,"　　　たまねぎ",null,"　"]
[null,"",null,"",null,"　レモン果汁(0.26)",null,"●⑦調味料等",null,"　　⑩調味料等",null,"　"]
[null,null,null,null,null,"　一味唐辛子(0.02)",null,null,null,null,null,"　"]
["その他","【ケチャップ小袋】",null,"【いわしの干し小魚】",null,"",null,"【手巻きのり】",null,"【ブルーベリージャム】",null,"　"]
[null,"　トマトケチャップ(8)",null,"　いわしの干し小魚(5)",null,"",null,"　手巻きのり(3)",null,"　ブルーベリージャム(15)",null,"　"]
[null,"",null,"",null,"",null,"",null,"",null,"　"]
[null,null,null,null,null,null,null,null,null,null,"（　）内は純使用量　単位：グラム","　"]
["　",null,null,null,null,null,null,null,null,null,null,"　"]
["　",null,null,null,"中学校－３",null,null,null,null,null,null,"　"]
["日","2026-07-15",null,"2026-07-16",null,null,null,null,null,null,null,"　"]
["主食","ごはん",null,"ごはん",null,null,null,null,null,null,null,"　"]
["牛乳","◎牛乳",null,"◎牛乳",null,null,null,null,null,null,null,"　"]
[null,"通常給食","アレルギー給食\n(卵･乳･えび･かに除去)","通常給食","アレルギー給食\n(卵･乳･えび･かに除去)",null,null,null,null,null,null,"　"]
["食缶","【大根と豚肉の煮物】",null,"【もずく汁】",null,null,"※　アレルギー物質の19品目について、次のように表示しています。",null,null,null,null,"　"]
[null,"　大根(71.5)",null,"⑧鶏肉(26)",null,"　","○…卵","◎…乳","●…小麦","△…えび","▲…かに","　"]
[null,"　さといも(45.5)",null,"⑫ながいも(19.5)",null,"　","①…いか","②…オレンジ","③…牛肉","④…ごま","⑤…さけ","　"]
[null,"⑩豚肉(26)",null,"　にんじん(13)",null,"　","⑥…さば","⑦…大豆","⑧…鶏肉","⑨…バナナ","⑩…豚肉","　"]
[null,"⑦生揚げ(32.5)",null,"　かまぼこ(13)",null,"　","⑪…もも","⑫…やまいも","⑬…りんご","⑭…ゼラチン",null,"　"]
[null,"　にんじん(26)",null,"　えのきたけ(13)",null,null,"１　パンに表示される⑦大豆については、油、乳化剤（大豆由来）のアレルゲンを示します。",null,null,null,null,"　"]
[null,"　昆布(0.65)",null,"　ねぎ(13)",null,null,"２　アレルギー献立表の見方については、「保存版ＮＯ．１」を参照してください。",null,null,null,null,"　"]
[null,"●⑦しょうゆ(6.5)",null,"　もずく(13)",null,null,"３　「むろ削り」または「和風だしの素」については、「だし」と表記しています。",null,null,null,null,"　"]
[null,"　砂糖(3.25)",null,"　しょうが(0.65)",null,null,null,null,null,null,null,"　"]
[null,"　酒(2.6)",null,"●⑦しょうゆ(5.2)",null,null,null,null,null,null,null,"　"]
[null,"　本みりん(1.3)",null,"　酒(1.3)",null,null,null,null,null,null,null,"　"]
[null,"　だし",null,"　塩(0.07)",null,null,null,null,null,null,null,"　"]
[null,"",null,"　だし",null,null,null,null,null,null,null,"　"]
[null,"",null,"",null,null,null,null,null,null,null,"　"]
["フライ缶","【ちくわの\n　　　いそべ揚げ】",null,"【ゴーヤ\n　　　チャンプルー】","【＊ゴーヤ\n　　　チャンプルー】",null,null,null,null,null,null,"　"]
[null,"　焼きちくわ(60)",null,"⑦生揚げ(32.5)","⑦生揚げ(45.5)",null,"※　春日井市食育推進給食会ホームページに、当市が表示するアレルゲン19品目",null,null,null,null,"　"]
[null,"●小麦粉(3.9)",null,"○炒り卵(26)","　ゴーヤ(19.5)",null,"　 のアレルギーマークを検索して強調表示する機能を持つ「マーク強調機能付",null,null,null,null,"　"]
[null,"　でん粉(1.3)",null,"　ゴーヤ(19.5)","⑩豚肉(32.5)",null,"　 アレルギー献立表」を掲載しています。",null,null,null,null,"　"]
[null,"　青のり粉(0.16)",null,"⑩豚肉(19.5)","●⑦しょうゆ(2.6)",null,"　　　https://www.kasugai-kyushoku.com/kondatehyou/allergy_mark/",null,null,null,null,"　"]
[null,"　米油(6.54)",null,"●⑦しょうゆ(2.6)","　砂糖(2.6)",null,null,null,null,null,null,"　"]
[null,"",null,"　砂糖(2.6)","⑦⑧⑩中華だしの素\n　　　　　　(0.65)",null,null,null,null,null,null,"　"]
[null,"",null,"⑦⑧⑩中華だしの素\n　　　　　　(0.65)","　米油(0.39)",null,null,null,null,null,null,"　"]
[null,"",null,"　米油(0.39)","　塩(0.13)",null,null,null,null,null,null,"　"]
[null,"",null,"　塩(0.13)","　こしょう(0.04)",null,null,null,null,null,null,"　"]
[null,"",null,"　こしょう(0.04)",null,null,null,null,null,null,null,"　"]
[null,"",null,null,null,null,null,null,null,null,null,"　"]
[null,"",null,"",null,null,null,null,null,null,null,"　"]
["あえ物・果物","【キャベツのゆかり和え】",null,"",null,null,null,null,null,null,null,"　"]
[null,"　キャベツ(32.5)",null,"",null,null,null,null,null,null,null,"　"]
[null,"　ゆかり粉(0.65)",null,"",null,null,null,null,null,null,null,"　"]
[null,null,null,null,null,null,null,null,null,null,null,"　"]
[null,"",null,"",null,null,null,null,null,null,null,"　"]
["その他","",null,"【セレクトデザート】",null,null,null,null,null,null,null,"　"]
[null,"",null,"⑦米粉シークワーサータルト(25)",null,null,null,null,null,null,null,"　"]
[null,"",null,"⑪ピーチゼリー(70)",null,null,null,null,null,null,null,"　"]
[null,"",null,"",null,null,null,null,null,null,null,"　"]
["　",null,null,null,"（　）内は純使用量　単位：グラム",null,null,null,null,null,null,"　"]

{"sheet":"対象者","index":1,"n_rows":101,"n_cols":21,"rows_kept":101,"cut":false,"hidden":true,"merged":[]}
["番号","学校","学年","組","氏名","アレ１","１記号","アレ２","２記号","アレ３","３記号","アレ４","４記号","アレ５","５記号","アレ６","６記号","アレ７","７記号",1,"アレルゲンはドロップダウンリストから選択してください。"]
[1,null,null,null,null,null,"---",null,"---",null,"---",null,"---",null,"---",null,"---",null,"---",2,"アレルギー献立表に表示可能なアレルゲンは５種類までとなります。※６、７は参考入力"]
[2,null,null,null,null,null,"---",null,"---",null,"---",null,"---",null,"---",null,"---",null,"---","※","５種類を超えるアレルゲンのある場合は、弁当持参を促すべき児童生徒と言えます。"]
[3,null,null,null,null,null,"---",null,"---",null,"---",null,"---",null,"---",null,"---",null,"---",3,"このリストをアレルギー献立表の「対象者」シートにコピーして「値のみ」を貼り付けてください。"]
[4,null,null,null,null,null,"---",null,"---",null,"---",null,"---",null,"---",null,"---",null,"---",4,"対象者を100人以上登録したいときは、A100～R101を選択してコピー（又はオートフィル）してください。"]
[5,null,null,null,null,null,"---",null,"---",null,"---",null,"---",null,"---",null,"---",null,"---"]
[6,null,null,null,null,null,"---",null,"---",null,"---",null,"---",null,"---",null,"---",null,"---"]
[7,null,null,null,null,null,"---",null,"---",null,"---",null,"---",null,"---",null,"---",null,"---"]
[8,null,null,null,null,null,"---",null,"---",null,"---",null,"---",null,"---",null,"---",null,"---"]
[9,null,null,null,null,null,"---",null,"---",null,"---",null,"---",null,"---",null,"---",null,"---"]
[10,null,null,null,null,null,"---",null,"---",null,"---",null,"---",null,"---",null,"---",null,"---"]
[11,null,null,null,null,null,"---",null,"---",null,"---",null,"---",null,"---",null,"---",null,"---"]
[12,null,null,null,null,null,"---",null,"---",null,"---",null,"---",null,"---",null,"---",null,"---"]
[13,null,null,null,null,null,"---",null,"---",null,"---",null,"---",null,"---",null,"---",null,"---"]
[14,null,null,null,null,null,"---",null,"---",null,"---",null,"---",null,"---",null,"---",null,"---"]
[15,null,null,null,null,null,"---",null,"---",null,"---",null,"---",null,"---",null,"---",null,"---"]
[16,null,null,null,null,null,"---",null,"---",null,"---",null,"---",null,"---",null,"---",null,"---"]
[17,null,null,null,null,null,"---",null,"---",null,"---",null,"---",null,"---",null,"---",null,"---"]
[18,null,null,null,null,null,"---",null,"---",null,"---",null,"---",null,"---",null,"---",null,"---"]
[19,null,null,null,null,null,"---",null,"---",null,"---",null,"---",null,"---",null,"---",null,"---"]
[20,null,null,null,null,null,"---",null,"---",null,"---",null,"---",null,"---",null,"---",null,"---"]
[21,null,null,null,null,null,"---",null,"---",null,"---",null,"---",null,"---",null,"---",null,"---"]
[22,null,null,null,null,null,"---",null,"---",null,"---",null,"---",null,"---",null,"---",null,"---"]
[23,null,null,null,null,null,"---",null,"---",null,"---",null,"---",null,"---",null,"---",null,"---"]
[24,null,null,null,null,null,"---",null,"---",null,"---",null,"---",null,"---",null,"---",null,"---"]
[25,null,null,null,null,null,"---",null,"---",null,"---",null,"---",null,"---",null,"---",null,"---"]
[26,null,null,null,null,null,"---",null,"---",null,"---",null,"---",null,"---",null,"---",null,"---"]
[27,null,null,null,null,null,"---",null,"---",null,"---",null,"---",null,"---",null,"---",null,"---"]
[28,null,null,null,null,null,"---",null,"---",null,"---",null,"---",null,"---",null,"---",null,"---"]
[29,null,null,null,null,null,"---",null,"---",null,"---",null,"---",null,"---",null,"---",null,"---"]
[30,null,null,null,null,null,"---",null,"---",null,"---",null,"---",null,"---",null,"---",null,"---"]
[31,null,null,null,null,null,"---",null,"---",null,"---",null,"---",null,"---",null,"---",null,"---"]
[32,null,null,null,null,null,"---",null,"---",null,"---",null,"---",null,"---",null,"---",null,"---"]
[33,null,null,null,null,null,"---",null,"---",null,"---",null,"---",null,"---",null,"---",null,"---"]
[34,null,null,null,null,null,"---",null,"---",null,"---",null,"---",null,"---",null,"---",null,"---"]
[35,null,null,null,null,null,"---",null,"---",null,"---",null,"---",null,"---",null,"---",null,"---"]
[36,null,null,null,null,null,"---",null,"---",null,"---",null,"---",null,"---",null,"---",null,"---"]
[37,null,null,null,null,null,"---",null,"---",null,"---",null,"---",null,"---",null,"---",null,"---"]
[38,null,null,null,null,null,"---",null,"---",null,"---",null,"---",null,"---",null,"---",null,"---"]
[39,null,null,null,null,null,"---",null,"---",null,"---",null,"---",null,"---",null,"---",null,"---"]
[40,null,null,null,null,null,"---",null,"---",null,"---",null,"---",null,"---",null,"---",null,"---"]
[41,null,null,null,null,null,"---",null,"---",null,"---",null,"---",null,"---",null,"---",null,"---"]
[42,null,null,null,null,null,"---",null,"---",null,"---",null,"---",null,"---",null,"---",null,"---"]
[43,null,null,null,null,null,"---",null,"---",null,"---",null,"---",null,"---",null,"---",null,"---"]
[44,null,null,null,null,null,"---",null,"---",null,"---",null,"---",null,"---",null,"---",null,"---"]
[45,null,null,null,null,null,"---",null,"---",null,"---",null,"---",null,"---",null,"---",null,"---"]
[46,null,null,null,null,null,"---",null,"---",null,"---",null,"---",null,"---",null,"---",null,"---"]
[47,null,null,null,null,null,"---",null,"---",null,"---",null,"---",null,"---",null,"---",null,"---"]
[48,null,null,null,null,null,"---",null,"---",null,"---",null,"---",null,"---",null,"---",null,"---"]
[49,null,null,null,null,null,"---",null,"---",null,"---",null,"---",null,"---",null,"---",null,"---"]
[50,null,null,null,null,null,"---",null,"---",null,"---",null,"---",null,"---",null,"---",null,"---"]
[51,null,null,null,null,null,"---",null,"---",null,"---",null,"---",null,"---",null,"---",null,"---"]
[52,null,null,null,null,null,"---",null,"---",null,"---",null,"---",null,"---",null,"---",null,"---"]
[53,null,null,null,null,null,"---",null,"---",null,"---",null,"---",null,"---",null,"---",null,"---"]
[54,null,null,null,null,null,"---",null,"---",null,"---",null,"---",null,"---",null,"---",null,"---"]
[55,null,null,null,null,null,"---",null,"---",null,"---",null,"---",null,"---",null,"---",null,"---"]
[56,null,null,null,null,null,"---",null,"---",null,"---",null,"---",null,"---",null,"---",null,"---"]
[57,null,null,null,null,null,"---",null,"---",null,"---",null,"---",null,"---",null,"---",null,"---"]
[58,null,null,null,null,null,"---",null,"---",null,"---",null,"---",null,"---",null,"---",null,"---"]
[59,null,null,null,null,null,"---",null,"---",null,"---",null,"---",null,"---",null,"---",null,"---"]
[60,null,null,null,null,null,"---",null,"---",null,"---",null,"---",null,"---",null,"---",null,"---"]
[61,null,null,null,null,null,"---",null,"---",null,"---",null,"---",null,"---",null,"---",null,"---"]
[62,null,null,null,null,null,"---",null,"---",null,"---",null,"---",null,"---",null,"---",null,"---"]
[63,null,null,null,null,null,"---",null,"---",null,"---",null,"---",null,"---",null,"---",null,"---"]
[64,null,null,null,null,null,"---",null,"---",null,"---",null,"---",null,"---",null,"---",null,"---"]
[65,null,null,null,null,null,"---",null,"---",null,"---",null,"---",null,"---",null,"---",null,"---"]
[66,null,null,null,null,null,"---",null,"---",null,"---",null,"---",null,"---",null,"---",null,"---"]
[67,null,null,null,null,null,"---",null,"---",null,"---",null,"---",null,"---",null,"---",null,"---"]
[68,null,null,null,null,null,"---",null,"---",null,"---",null,"---",null,"---",null,"---",null,"---"]
[69,null,null,null,null,null,"---",null,"---",null,"---",null,"---",null,"---",null,"---",null,"---"]
[70,null,null,null,null,null,"---",null,"---",null,"---",null,"---",null,"---",null,"---",null,"---"]
[71,null,null,null,null,null,"---",null,"---",null,"---",null,"---",null,"---",null,"---",null,"---"]
[72,null,null,null,null,null,"---",null,"---",null,"---",null,"---",null,"---",null,"---",null,"---"]
[73,null,null,null,null,null,"---",null,"---",null,"---",null,"---",null,"---",null,"---",null,"---"]
[74,null,null,null,null,null,"---",null,"---",null,"---",null,"---",null,"---",null,"---",null,"---"]
[75,null,null,null,null,null,"---",null,"---",null,"---",null,"---",null,"---",null,"---",null,"---"]
[76,null,null,null,null,null,"---",null,"---",null,"---",null,"---",null,"---",null,"---",null,"---"]
[77,null,null,null,null,null,"---",null,"---",null,"---",null,"---",null,"---",null,"---",null,"---"]
[78,null,null,null,null,null,"---",null,"---",null,"---",null,"---",null,"---",null,"---",null,"---"]
[79,null,null,null,null,null,"---",null,"---",null,"---",null,"---",null,"---",null,"---",null,"---"]
[80,null,null,null,null,null,"---",null,"---",null,"---",null,"---",null,"---",null,"---",null,"---"]
[81,null,null,null,null,null,"---",null,"---",null,"---",null,"---",null,"---",null,"---",null,"---"]
[82,null,null,null,null,null,"---",null,"---",null,"---",null,"---",null,"---",null,"---",null,"---"]
[83,null,null,null,null,null,"---",null,"---",null,"---",null,"---",null,"---",null,"---",null,"---"]
[84,null,null,null,null,null,"---",null,"---",null,"---",null,"---",null,"---",null,"---",null,"---"]
[85,null,null,null,null,null,"---",null,"---",null,"---",null,"---",null,"---",null,"---",null,"---"]
[86,null,null,null,null,null,"---",null,"---",null,"---",null,"---",null,"---",null,"---",null,"---"]
[87,null,null,null,null,null,"---",null,"---",null,"---",null,"---",null,"---",null,"---",null,"---"]
[88,null,null,null,null,null,"---",null,"---",null,"---",null,"---",null,"---",null,"---",null,"---"]
[89,null,null,null,null,null,"---",null,"---",null,"---",null,"---",null,"---",null,"---",null,"---"]
[90,null,null,null,null,null,"---",null,"---",null,"---",null,"---",null,"---",null,"---",null,"---"]
[91,null,null,null,null,null,"---",null,"---",null,"---",null,"---",null,"---",null,"---",null,"---"]
[92,null,null,null,null,null,"---",null,"---",null,"---",null,"---",null,"---",null,"---",null,"---"]
[93,null,null,null,null,null,"---",null,"---",null,"---",null,"---",null,"---",null,"---",null,"---"]
[94,null,null,null,null,null,"---",null,"---",null,"---",null,"---",null,"---",null,"---",null,"---"]
[95,null,null,null,null,null,"---",null,"---",null,"---",null,"---",null,"---",null,"---",null,"---"]
[96,null,null,null,null,null,"---",null,"---",null,"---",null,"---",null,"---",null,"---",null,"---"]
[97,null,null,null,null,null,"---",null,"---",null,"---",null,"---",null,"---",null,"---",null,"---"]
[98,null,null,null,null,null,"---",null,"---",null,"---",null,"---",null,"---",null,"---",null,"---"]
[99,null,null,null,null,null,"---",null,"---",null,"---",null,"---",null,"---",null,"---",null,"---"]
[100,null,null,null,null,null,"---",null,"---",null,"---",null,"---",null,"---",null,"---",null,"---"]

{"sheet":"アレルゲン","index":2,"n_rows":5,"n_cols":4,"rows_kept":5,"cut":false,"hidden":true,"merged":[]}
[1,{"$f":"VLOOKUP(D$1,対象者!$A:$S,7,FALSE)","v":{"$error":"#N/A"}},"個人番号",{"$f":"'アレルギー献立表（中学校）'!M3","v":0}]
[2,{"$f":"VLOOKUP(D$1,対象者!$A:$S,9,FALSE)","v":{"$error":"#N/A"}}]
[3,{"$f":"VLOOKUP(D$1,対象者!$A:$S,11,FALSE)","v":{"$error":"#N/A"}}]
[4,{"$f":"VLOOKUP(D$1,対象者!$A:$S,13,FALSE)","v":{"$error":"#N/A"}}]
[5,{"$f":"VLOOKUP(D$1,対象者!$A:$S,15,FALSE)","v":{"$error":"#N/A"}}]