{"text_format":"1","workbook":"xlsx","n_sheets":3,"sheets":["アレルギー献立表（中） ","対象者","アレルゲン"],"not_rendered":{"charts":0,"images":1,"macros":1,"external_links":1,"defined_names":1,"comments":0,"pivot_tables":0},"unopened":[],"bounds":{"document_bytes":16777216,"sheet_cells":100000,"rows_first":2000,"rows_last":500,"rows_between":2000,"halvings":0,"cell_chars":16384,"cell_head_chars":4096},"cells_cut":0,"cells_raw":0,"read":"whole","date_system":"1900"}

{"sheet":"アレルギー献立表（中） ","index":0,"n_rows":209,"n_cols":13,"rows_kept":209,"cut":false,"hidden":false,"merged":[[151,0,153,0],[79,0,91,0],[92,0,94,0],[95,0,102,0],[117,0,133,0],[134,0,150,0],[9,0,26,0],[27,0,40,0],[41,0,49,0],[50,0,57,0],[64,0,78,0],[164,0,185,0],[186,0,200,0],[201,0,204,0],[205,0,207,0],[154,0,156,0]]}
[null,{"$f":"CONCATENATE(IFERROR(VLOOKUP($M$3,対象者!$A:$O,2,FALSE),\"\"),DBCS(IFERROR(VLOOKUP($M$3,対象者!$A:$O,3,FALSE),\"\")),IFERROR(IF($M$3=\"\",\"\",\"年\"),\"\"))","v":""},{"$f":"IFERROR(VLOOKUP($M$3,対象者!$A:$O,4,FALSE),\"\")","v":""},{"$f":"IFERROR(VLOOKUP($M$3,対象者!$A:$O,5,FALSE),\"\")","v":""},null,null,null,null,null,null,null,"　"]
[null,{"$f":"CONCATENATE(IFERROR(VLOOKUP($M$3,対象者!$A:$O,6,FALSE),\"\"),\" \",IFERROR(VLOOKUP($M$3,対象者!$A:$O,7,FALSE),\"\"))","v":" "},{"$f":"CONCATENATE(IFERROR(VLOOKUP($M$3,対象者!$A:$O,8,FALSE),\"\"),\" \",IFERROR(VLOOKUP($M$3,対象者!$A:$O,9,FALSE),\"\"))","v":" "},{"$f":"CONCATENATE(IFERROR(VLOOKUP($M$3,対象者!$A:$O,10,FALSE),\"\"),\" \",IFERROR(VLOOKUP($M$3,対象者!$A:$O,11,FALSE),\"\"))","v":" "},{"$f":"CONCATENATE(IFERROR(VLOOKUP($M$3,対象者!$A:$O,12,FALSE),\"\"),\" \",IFERROR(VLOOKUP($M$3,対象者!$A:$O,13,FALSE),\"\"))","v":" "},{"$f":"CONCATENATE(IFERROR(VLOOKUP($M$3,対象者!$A:$O,14,FALSE),\"\"),\" \",IFERROR(VLOOKUP($M$3,対象者!$A:$O,15,FALSE),\"\"))","v":" "},null,null,null,null,null,"　","番号"]
["　","令和8年度　5月アレルギー献立表（通常献立、アレルギー給食献立）",null,null,null,null,null,null,null,null,"中学校－１","　"]
[null,"１　通常給食を食べている人（一部を無配膳対応としている人を含む）は、「通常給食」欄を確認してください。",null,null,null,null,null,null,null,null,null,"　"]
[null,"２　アレルギー給食（卵･乳･えび･かにを除去した給食）を食べている人は、「アレルギー給食」欄を確認してください。ただし、通常給食とアレルギー給食の献立内容が同じ場合は、アレルギー給食の欄は空欄としています。",null,null,null,null,null,null,null,null,null,"　"]
["日","2026-05-01",null,"2026-05-07",null,"2026-05-08",null,"2026-05-11",null,"2026-05-12",null,"　"]
["主食","ごはん",null,"玄米ごはん",null,"ごはん",null,"麦ごはん",null,"◎●⑦クロスロールパン",null,"　"]
["牛乳","◎牛乳",null,"◎牛乳",null,"◎牛乳",null,"◎牛乳",null,"◎牛乳",null,"　"]
[null,"通常給食","アレルギー給食\n(卵･乳･えび･かに除去)","通常給食","アレルギー給食\n(卵･乳･えび･かに除去)","通常給食","アレルギー給食\n(卵･乳･えび･かに除去)","通常給食","アレルギー給食\n(卵･乳･えび･かに除去)","通常給食","アレルギー給食\n(卵･乳･えび･かに除去)","　"]
["食缶","【わかたけ汁】",null,"【えがおの\n　　カレーシチュー】",null,"【ふき入り筑前煮】",null,"【豚汁】",null,"【大豆とチキンの\n　　　　　トマト煮】",null,"　"]
[null,"　たけのこ(19.5)",null,"　たまねぎ(52)",null,"　じゃがいも(52)",null,"⑦豆腐(32.5)",null,"　たまねぎ(52)",null,"　"]
[null,"　はくさい(13)",null,"　じゃがいも(45.5)",null,"⑧鶏肉(26)",null,"　じゃがいも(13)",null,"⑦大豆(45.5)",null,"　"]
[null,"　にんじん(13)",null,"⑩豚肉(19.5)",null,"　にんじん(26)",null,"⑩豚肉(13)",null,"　じゃがいも(32.5)",null,"　"]
[null,"⑧鶏肉(19.5)",null,"　にんじん(19.5)",null,"⑦さつま揚げ(19.5)",null,"　大根(13)",null,"　にんじん(26)",null,"　"]
[null,"　ねぎ(13)",null,"　マッシュルーム(6.5)",null,"　ごぼう(15.6)",null,"　ごぼう(13)",null,"　トマト(26)",null,"　"]
[null,"⑦油揚げ(3.9)",null,"　にんにく(0.13)",null,"　こんにゃく(13)",null,"　にんじん(13)",null,"⑧鶏肉(19.5)",null,"　"]
[null,"　しいたけ(1.3)",null,"　カレールウ\n　　　[えがお](16.9)",null,"　たけのこ(13)",null,"　こんにゃく(13)",null,"　セロリ(2.6)",null,"　"]
[null,"　わかめ(0.65)",null,"　ソース(3.25)",null,"　ふき(10.4)",null,"　ねぎ(6.5)",null,"　にんにく(0.39)",null,"　"]
[null,"●⑦うす口しょうゆ\n　　　　　　(4.55)",null,"　野菜ブイヨン(1.3)",null,"　さやいんげん(6.5)",null,"⑦豆みそ(11.7)",null,"　トマトジュース(26)",null,"　"]
[null,"　本みりん(1.3)",null,"　トマトケチャップ\n　　　　　　　(2.6)",null,"　しいたけ(1.3)",null,"　だし",null,"　トマトケチャップ\n　　　　　　　　(9.1)",null,"　"]
[null,"　塩(0.39)",null,"●⑦しょうゆ(0.65)",null,"●⑦しょうゆ(6.5)",null,"",null,"　ソース(2.6)",null,"　"]
[null,"　だし",null,"　純カレー(0.13)",null,"　砂糖(3.9)",null,"",null,"　砂糖(2.6)",null,"　"]
[null,"",null,"　塩(0.13)",null,"　本みりん(1.3)",null,"",null,"⑦⑩洋風だしの素(1.3)",null,"　"]
[null,"",null,"　こしょう(0.03)",null,"　酒(1.3)",null,"",null,"　赤ワイン(1.3)",null,"　"]
[null,"",null,"",null,"　だし",null,"",null,"　塩(0.52)",null,"　"]
[null,"",null,"",null,"",null,"",null,"　こしょう(0.04)",null,"　"]
[null,"",null,"",null,"",null,"",null,"",null,"　"]
["フライ缶","【ちくわの\n　　お茶天ぷら】",null,"【切り干し大根\n　　　　　サラダ】",null,"【愛知のれんこん入り\n　　　　　　つくね】",null,"【まぐろの甘辛煮】",null,"【アスパラガスの\n　　　　　サラダ】",null,"　"]
[null,"　ちくわ(60)",null,"　きゅうり(13)",null,"　れんこん入り",null,"　まぐろ油漬け(58.5)",null,"　キャベツ(26)",null,"　"]
[null,"　お茶の粉(0.39)",null,"⑧鶏肉(13)",null,"　　　　　つくね(60)",null,"　キャベツ(15.6)",null,"　とうもろこし(15.6)",null,"　"]
[null,"●小麦粉(3.9)",null,"　とうもろこし(13)",null,"",null,"　しょうが(1.3)",null,"　きゅうり(13)",null,"　"]
[null,"　でん粉(1.3)",null,"　にんじん(6.5)",null,"《れんこん入り\n　　　　 つくね》",null,"　砂糖(3.9)",null,"　まぐろ油漬け(13)",null,"　"]
[null,"　米油(5.76)",null,"　切り干し大根(3.9)",null,"⑧鶏肉",null,"●⑦しょうゆ(1.95)",null,"　アスパラガス(13)",null,"　"]
[null,"",null,"　卵なしマヨネーズ\n　　　　　　　(7.8)",null,"　れんこん",null,"　本みりん(1.3)",null,"●⑦しょうゆ(1.56)",null,"　"]
[null,"",null,"●⑦しょうゆ(1.56)",null,"　たまねぎ",null,"　酒(1.3)",null,"　砂糖(1.3)",null,"　"]
[null,"",null,"④白ごま(1.3)",null,"⑦粒状植物性たん白",null,"",null,"　ワインビネガー(1.04)",null,"　"]
[null,"",null,"　米酢(0.65)",null,"⑦調味料等",null,"",null,"　サラダ油(0.65)",null,"　"]
[null,"",null,"　砂糖(0.65)",null,"",null,"",null,"　塩(0.13)",null,"　"]
[null,"",null,"　塩(0.13)",null,"",null,"",null,"　こしょう(0.03)",null,"　"]
[null,"",null,"　こしょう(0.04)",null,"",null,"",null,"",null,"　"]
[null,"",null,"",null,"",null,"",null,"",null,"　"]
["あえ物・果物","【もやしのごまじょうゆ和え】",null,"",null,"【きゅうりの塩昆布あえ】",null,"【きざみたくあん】",null,"",null,"　"]
[null,"　もやし(32.5)",null,"　《卵なしマヨネーズ》",null,"　きゅうり(32.5)",null,"　たくあん漬け(16.9)",null,"",null,"　"]
[null,"④白ごま(0.65)",null,"　⑦粉末状植物性たん白",null,"　にんじん(3.9)",null,"",null,"",null,"　"]
[null,"　花かつお(0.26)",null,"　　調味料等",null,"　塩昆布(1.56)",null,"≪たくあん漬け≫",null,"",null,"　"]
[null,"●⑦しょうゆ(1.56)",null,null,null,null,null,"　大根",null,null,null,"　"]
[null,"④ごま油(0.26)",null,null,null,"《塩昆布》",null,"●⑦調味料等",null,null,null,"　"]
[null,null,null,null,null,"　昆布",null,null,null,null,null,"　"]
[null,null,null,null,null,"●⑦調味料等",null,null,null,null,null,"　"]
[null,"",null,"",null,"",null,"",null,"",null,"　"]
["その他","【かしわもち】",null,"【フローズンヨーグルト】",null,"",null,"【手巻きのり】",null,"",null,"　"]
[null,"　かしわもち(30)",null,"◎ヨーグルト(60)",null,"",null,"　手巻きのり(3)",null,"",null,"　"]
[null,null,null,null,null,null,null,null,null,null,null,"　"]
[null,"《かしわもち》",null,null,null,null,null,null,null,null,null,"　"]
[null,"　小豆粒あん",null,null,null,null,null,null,null,null,null,"　"]
[null,"　米粉",null,null,null,null,null,null,null,null,null,"　"]
[null,"⑦調味料等",null,null,null,null,null,null,null,null,null,"　"]
[null,"",null,"",null,"",null,"",null,"",null,"　"]
["　",null,null,null,null,null,null,null,null,null,"（　）内は純使用量　単位：グラム","　"]
["　",null,null,null,null,null,null,null,null,null,"中学校－２","　"]
["日",{"$f":"[1]⑥!A2","v":"2026-05-13"},null,{"$f":"[1]⑦!A2","v":"2026-05-14"},null,{"$f":"[1]⑧!A2","v":"2026-05-15"},null,{"$f":"[1]⑨!A2","v":"2026-05-18"},null,{"$f":"[1]⑩!A2","v":"2026-05-19"},null,"　"]
["主食","麦ごはん",null,"ごはん",null,"わかめごはん",null,"ごはん",null,"麦ごはん",null,"　"]
["牛乳","◎牛乳",null,"◎牛乳",null,"◎牛乳",null,"◎牛乳",null,"◎牛乳",null,"　"]
[null,"通常給食","アレルギー給食\n(卵･乳･えび･かに除去)","通常給食","アレルギー給食\n(卵･乳･えび･かに除去)","通常給食","アレルギー給食\n(卵･乳･えび･かに除去)","通常給食","アレルギー給食\n(卵･乳･えび･かに除去)","通常給食","アレルギー給食\n(卵･乳･えび･かに除去)","　"]
["食缶","【にら卵スープ】","【＊にらスープ】","【肉じゃが】",null,"【けんちん汁】",null,"【高野豆腐の卵とじ】","【＊高野豆腐の\n　　　　　うま煮】","【さわにわん】",null,"　"]
[null,"　たまねぎ(39)","　たまねぎ(52)","　じゃがいも(117)",null,"⑦豆腐(32.5)",null,"○液卵(52)","　たまねぎ(58.5)","⑩豚肉(26)",null,"　"]
[null,"⑧肉団子(39)","⑧肉団子(45.5)","　たまねぎ(52)",null,"　大根(26)",null,"　たまねぎ(39)","　じゃがいも(45.5)","⑫ながいも(13)",null,"　"]
[null,"○液卵(26)","　にんじん(13)","　こんにゃく(26)",null,"　こんにゃく(19.5)",null,"　じゃがいも(32.5)","　にんじん(13)","　かまぼこ(13)",null,"　"]
[null,"　にんじん(13)","　たけのこ(13)","　にんじん(26)",null,"　にんじん(13)",null,"　にんじん(13)","⑧鶏肉(26)","　にんじん(13)",null,"　"]
[null,"　たけのこ(13)","　にら(3.9)","⑩豚肉(19.5)",null,"　ごぼう(13)",null,"⑧鶏肉(13)","　かまぼこ(13)","　たけのこ(6.5)",null,"　"]
[null,"　にら(3.9)","●⑦しょうゆ(2.6)","⑦枝豆(5.2)",null,"　ねぎ(13)",null,"　かまぼこ(13)","　さやいんげん(6.5)","　ごぼう(13)",null,"　"]
[null,"●⑦しょうゆ(2.6)","⑦⑧⑩中華だしの\n　　　　　　素(1.3)","●⑦しょうゆ(5.85)",null,"⑦油揚げ(2.6)",null,"　さやいんげん(6.5)","⑦高野豆腐(9.1)","　小松菜(13)",null,"　"]
[null,"⑦⑧⑩中華だしの\n　　　　　　素(1.3)","　塩(0.65)","　砂糖(3.9)",null,"●⑦しょうゆ(5.2)",null,"⑦高野豆腐(6.5)","●⑦しょうゆ(5.85)","●⑦しょうゆ(5.2)",null,"　"]
[null,"　塩(0.65)","　こしょう(0.03)","　本みりん(1.3)",null,"④ごま油(0.65)",null,"●⑦しょうゆ(5.85)","　砂糖(3.25)","　塩(0.39)",null,"　"]
[null,"　こしょう(0.03)","　でん粉(0.65)","　塩(0.26)",null,"　塩(0.39)",null,"　砂糖(3.25)","　本みりん(1.3)","　こしょう(0.03)",null,"　"]
[null,"　でん粉(0.65)",null,"　こしょう(0.03)",null,"　だし",null,"　本みりん(1.3)","　塩(0.26)","　だし",null,"　"]
[null,"",null,"",null,"",null,"　塩(0.26)","　だし","",null,"　"]
[null,"",null,"",null,"",null,"　だし","　でん粉(0.65)","",null,"　"]
[null,"",null,"",null,"",null,"",null,"",null,"　"]
["フライ缶","【生揚げの\n　　　肉味噌かけ】",null,"【ひじきサラダ】",null,"【きびなごの\n　　　南蛮漬け】",null,"【三色あえ】",null,"【かつおと大豆レモン\n　じょうゆ和え】",null,"　"]
[null,"⑦生揚げ(52)",null,"　ほうれん草(13)",null,"　きびなご唐揚げ(52)",null,"　もやし(19.5)",null,"　かつお打ち粉\n　　　　　付き(52)",null,"　"]
[null,"　にんじん(19.5)",null,"　キャベツ(16.9)",null,"　米油(5.2)",null,"　小松菜(19.5)",null,"⑦大豆(19.5)",null,"　"]
[null,"　たまねぎ(19.5)",null,"　まぐろ油漬け(19.5)",null,"　たまねぎ(13)",null,"　まぐろ油漬け(13)",null,"　でん粉(3.9)",null,"　"]
[null,"⑩豚肉(13)",null,"　にんじん(9.1)",null,"　黄パプリカ(6.5)",null,"　にんじん(6.5)",null,"　米油(7.8)",null,"　"]
[null,"⑦豆みそ(7.8)",null,"　とうもろこし(9.1)",null,"　赤パプリカ(6.5)",null,"　切り干し大根(3.25)",null,"⑦枝豆(6.5)",null,"　"]
[null,"　砂糖(5.2)",null,"④白ねりごま(6.5)",null,"　しょうが(0.39)",null,"④白すりごま(2.6)",null,"　砂糖(3.9)",null,"　"]
[null,"　本みりん(1.3)",null,"　ひじき(1.56)",null,"　米酢(2.6)",null,"④白ねりごま(2.6)",null,"　レモン果汁(2.99)",null,"　"]
[null,"　でん粉(0.39)",null,"●⑦しょうゆ(2.86)",null,"●⑦しょうゆ(2.6)",null,"●⑦しょうゆ(3.25)",null,"●⑦しょうゆ(1.95)",null,"　"]
[null,"",null,"　米酢(1.95)",null,"　砂糖(2.6)",null,"　砂糖(1.3)",null,"",null,"　"]
[null,"",null,"　砂糖(1.3)",null,"　酒(1.3)",null,"",null,"",null,"　"]
[null,"",null,"　塩(0.13)",null,"　一味唐辛子(0.03)",null,"",null,"",null,"　"]
[null,null,null,null,null,null,null,null,null,null,null,"　"]
["あえ物・果物","【冷凍パイナップル】",null,"",null,"",null,"",null,"",null,"　"]
[null,"　パイナップル(40)",null,"",null,"",null,"",null,"",null,"　"]
[null,"",null,"",null,"",null,"",null,"",null,"　"]
["その他","",null,"【黒糖そら豆】",null,"【きらず揚げ】",null,"",null,"【のり佃煮】",null,"　"]
[null,"",null,"　黒糖入りそら豆(5)",null,"　きらず揚げ(8)",null,"",null,"　のり佃煮(10)",null,"　"]
[null,null,null,null,null,null,null,null,null,null,null,"　"]
[null,null,null,null,null,"《きらず揚げ》",null,null,null,"《のり佃煮》",null,"　"]
[null,null,null,null,null,"●小麦粉",null,null,null,"　のり",null,"　"]
[null,null,null,null,null,"⑦おからパウダー",null,null,null,"⑦大豆食物繊維",null,"　"]
[null,"",null,"",null,"　調味料等",null,"",null,"●⑦調味料等",null,"　"]
[null,"",null,"",null,"",null,"",null,"",null,"　"]
["※","アレルギー物質の19品目について、次のように表示しています。",null,null,null,null,null,null,null,null,"（　）内は純使用量　単位：グラム","　"]
["　","○…卵","◎…乳","●…小麦","△…えび","▲…かに",null,null,null,null,null,"　"]
["　","①…いか","②…オレンジ","③…牛肉","④…ごま","⑤…さけ",null,"※　春日井市食育推進給食会ホームページに、当市が表示するアレルゲン19品目",null,null,null,"　"]
["　","⑥…さば","⑦…大豆","⑧…鶏肉","⑨…バナナ","⑩…豚肉",null,"　 のアレルギーマークを検索して強調表示する機能を持つ「マーク強調機能付",null,null,null,"　"]
["　","⑪…もも","⑫…やまいも","⑬…りんご","⑭…ゼラチン",null,null,"　 アレルギー献立表」を掲載しています。",null,null,null,"　"]
["１","パンに表示される⑦大豆については、添加物のレシチンに含まれる微量のアレルゲンを示します。",null,null,null,null,null,"　　　https://www.kasugai-kyushoku.com/kondatehyou/allergy_mark/",null,null,null,"　"]
["２","アレルギー献立表の見方については、「保存版ＮＯ．１」を参照してください。",null,null,null,null,null,null,null,null,null,"　"]
["３","「むろ削り」または「和風だしの素」については、「だし」と表記しています。",null,null,null,null,null,null,null,null,null,"　"]
["　",null,null,null,null,null,null,null,null,null,null,"　"]
["　",null,null,null,null,null,null,null,null,null,"中学校－３","　"]
["日","2026-05-20",null,"2026-05-21",null,"2026-05-22",null,"2026-05-25",null,"2026-05-26",null,"　"]
["主食","ごはん",null,"◎●⑦あいちの米粉パン",null,"ごはん",null,"◎●⑦ミルクロールパン",null,"麦ごはん",null,"　"]
["牛乳","◎牛乳",null,"◎牛乳",null,"◎牛乳",null,"◎牛乳",null,"◎牛乳",null,"　"]
[null,"通常給食","アレルギー給食\n(卵･乳･えび･かに除去)","通常給食","アレルギー給食\n(卵･乳･えび･かに除去)","通常給食","アレルギー給食\n(卵･乳･えび･かに除去)","通常給食","アレルギー給食\n(卵･乳･えび･かに除去)","通常給食","アレルギー給食\n(卵･乳･えび･かに除去)","　"]
["食缶","【トッポギスープ】",null,"【白いんげんとコーン\n　のポタージュ】","【＊白いんげんとコーン\n　のポタージュ】","【八宝菜】","【＊八宝菜】","【野菜スープ】",null,"【わかめスープ】",null,"　"]
[null,"　たまねぎ(32.5)",null,"　たまねぎ(39)","　たまねぎ(39)","　キャベツ(52)","　キャベツ(52)","　たまねぎ(45.5)",null,"　たまねぎ(39)",null,"　"]
[null,"　トッポギ(26)",null,"　白いんげん豆(32.5)","　白いんげん豆(32.5)","　たまねぎ(52)","　たまねぎ(58.5)","⑧鶏肉(26)",null,"　にんじん(13)",null,"　"]
{"$rows_left_out":90}
{"sheet":"対象者","index":1,"n_rows":101,"n_cols":21,"rows_kept":101,"cut":false,"hidden":true,"merged":[]}
["番号","学校","学年","組","氏名","アレ１","１記号","アレ２","２記号","アレ３","３記号","アレ４","４記号","アレ５","５記号","アレ６","６記号","アレ７","７記号",1,"アレルゲンはドロップダウンリストから選択してください。"]
[1,null,null,null,null,null,"---",null,"---",null,"---",null,"---",null,"---",null,"---",null,"---",2,"アレルギー献立表に表示可能なアレルゲンは５種類までとなります。※６、７は参考入力"]
[2,null,null,null,null,null,"---",null,"---",null,"---",null,"---",null,"---",null,"---",null,"---","※","５種類を超えるアレルゲンのある場合は、弁当持参を促すべき児童生徒と言えます。"]
[3,null,null,null,null,null,"---",null,"---",null,"---",null,"---",null,"---",null,"---",null,"---",3,"このリストをアレルギー献立表の「対象者」シートにコピーして「値のみ」を貼り付けてください。"]
[4,null,null,null,null,null,"---",null,"---",null,"---",null,"---",null,"---",null,"---",null,"---",4,"対象者を100人以上登録したいときは、A100～R101を選択してコピー（又はオートフィル）してください。"]
[5,null,null,null,null,null,"---",null,"---",null,"---",null,"---",null,"---",null,"---",null,"---"]
[6,null,null,null,null,null,"---",null,"---",null,"---",null,"---",null,"---",null,"---",null,"---"]
[7,null,null,null,null,null,"---",null,"---",null,"---",null,"---",null,"---",null,"---",null,"---"]
[8,null,null,null,null,null,"---",null,"---",null,"---",null,"---",null,"---",null,"---",null,"---"]
[9,null,null,null,null,null,"---",null,"---",null,"---",null,"---",null,"---",null,"---",null,"---"]
[10,null,null,null,null,null,"---",null,"---",null,"---",null,"---",null,"---",null,"---",null,"---"]
[11,null,null,null,null,null,"---",null,"---",null,"---",null,"---",null,"---",null,"---",null,"---"]
[12,null,null,null,null,null,"---",null,"---",null,"---",null,"---",null,"---",null,"---",null,"---"]
[13,null,null,null,null,null,"---",null,"---",null,"---",null,"---",null,"---",null,"---",null,"---"]
[14,null,null,null,null,null,"---",null,"---",null,"---",null,"---",null,"---",null,"---",null,"---"]
[15,null,null,null,null,null,"---",null,"---",null,"---",null,"---",null,"---",null,"---",null,"---"]
[16,null,null,null,null,null,"---",null,"---",null,"---",null,"---",null,"---",null,"---",null,"---"]
[17,null,null,null,null,null,"---",null,"---",null,"---",null,"---",null,"---",null,"---",null,"---"]
[18,null,null,null,null,null,"---",null,"---",null,"---",null,"---",null,"---",null,"---",null,"---"]
[19,null,null,null,null,null,"---",null,"---",null,"---",null,"---",null,"---",null,"---",null,"---"]
[20,null,null,null,null,null,"---",null,"---",null,"---",null,"---",null,"---",null,"---",null,"---"]
[21,null,null,null,null,null,"---",null,"---",null,"---",null,"---",null,"---",null,"---",null,"---"]
[22,null,null,null,null,null,"---",null,"---",null,"---",null,"---",null,"---",null,"---",null,"---"]
[23,null,null,null,null,null,"---",null,"---",null,"---",null,"---",null,"---",null,"---",null,"---"]
[24,null,null,null,null,null,"---",null,"---",null,"---",null,"---",null,"---",null,"---",null,"---"]
[25,null,null,null,null,null,"---",null,"---",null,"---",null,"---",null,"---",null,"---",null,"---"]
[26,null,null,null,null,null,"---",null,"---",null,"---",null,"---",null,"---",null,"---",null,"---"]
[27,null,null,null,null,null,"---",null,"---",null,"---",null,"---",null,"---",null,"---",null,"---"]
[28,null,null,null,null,null,"---",null,"---",null,"---",null,"---",null,"---",null,"---",null,"---"]
[29,null,null,null,null,null,"---",null,"---",null,"---",null,"---",null,"---",null,"---",null,"---"]
[30,null,null,null,null,null,"---",null,"---",null,"---",null,"---",null,"---",null,"---",null,"---"]
[31,null,null,null,null,null,"---",null,"---",null,"---",null,"---",null,"---",null,"---",null,"---"]
[32,null,null,null,null,null,"---",null,"---",null,"---",null,"---",null,"---",null,"---",null,"---"]
[33,null,null,null,null,null,"---",null,"---",null,"---",null,"---",null,"---",null,"---",null,"---"]
[34,null,null,null,null,null,"---",null,"---",null,"---",null,"---",null,"---",null,"---",null,"---"]
[35,null,null,null,null,null,"---",null,"---",null,"---",null,"---",null,"---",null,"---",null,"---"]
[36,null,null,null,null,null,"---",null,"---",null,"---",null,"---",null,"---",null,"---",null,"---"]
[37,null,null,null,null,null,"---",null,"---",null,"---",null,"---",null,"---",null,"---",null,"---"]
[38,null,null,null,null,null,"---",null,"---",null,"---",null,"---",null,"---",null,"---",null,"---"]
[39,null,null,null,null,null,"---",null,"---",null,"---",null,"---",null,"---",null,"---",null,"---"]
[40,null,null,null,null,null,"---",null,"---",null,"---",null,"---",null,"---",null,"---",null,"---"]
[41,null,null,null,null,null,"---",null,"---",null,"---",null,"---",null,"---",null,"---",null,"---"]
[42,null,null,null,null,null,"---",null,"---",null,"---",null,"---",null,"---",null,"---",null,"---"]
[43,null,null,null,null,null,"---",null,"---",null,"---",null,"---",null,"---",null,"---",null,"---"]
[44,null,null,null,null,null,"---",null,"---",null,"---",null,"---",null,"---",null,"---",null,"---"]
[45,null,null,null,null,null,"---",null,"---",null,"---",null,"---",null,"---",null,"---",null,"---"]
[46,null,null,null,null,null,"---",null,"---",null,"---",null,"---",null,"---",null,"---",null,"---"]
[47,null,null,null,null,null,"---",null,"---",null,"---",null,"---",null,"---",null,"---",null,"---"]
[48,null,null,null,null,null,"---",null,"---",null,"---",null,"---",null,"---",null,"---",null,"---"]
[49,null,null,null,null,null,"---",null,"---",null,"---",null,"---",null,"---",null,"---",null,"---"]
[50,null,null,null,null,null,"---",null,"---",null,"---",null,"---",null,"---",null,"---",null,"---"]
[51,null,null,null,null,null,"---",null,"---",null,"---",null,"---",null,"---",null,"---",null,"---"]
[52,null,null,null,null,null,"---",null,"---",null,"---",null,"---",null,"---",null,"---",null,"---"]
[53,null,null,null,null,null,"---",null,"---",null,"---",null,"---",null,"---",null,"---",null,"---"]
[54,null,null,null,null,null,"---",null,"---",null,"---",null,"---",null,"---",null,"---",null,"---"]
[55,null,null,null,null,null,"---",null,"---",null,"---",null,"---",null,"---",null,"---",null,"---"]
[56,null,null,null,null,null,"---",null,"---",null,"---",null,"---",null,"---",null,"---",null,"---"]
[57,null,null,null,null,null,"---",null,"---",null,"---",null,"---",null,"---",null,"---",null,"---"]
[58,null,null,null,null,null,"---",null,"---",null,"---",null,"---",null,"---",null,"---",null,"---"]
[59,null,null,null,null,null,"---",null,"---",null,"---",null,"---",null,"---",null,"---",null,"---"]
[60,null,null,null,null,null,"---",null,"---",null,"---",null,"---",null,"---",null,"---",null,"---"]
[61,null,null,null,null,null,"---",null,"---",null,"---",null,"---",null,"---",null,"---",null,"---"]
[62,null,null,null,null,null,"---",null,"---",null,"---",null,"---",null,"---",null,"---",null,"---"]
[63,null,null,null,null,null,"---",null,"---",null,"---",null,"---",null,"---",null,"---",null,"---"]
[64,null,null,null,null,null,"---",null,"---",null,"---",null,"---",null,"---",null,"---",null,"---"]
[65,null,null,null,null,null,"---",null,"---",null,"---",null,"---",null,"---",null,"---",null,"---"]
[66,null,null,null,null,null,"---",null,"---",null,"---",null,"---",null,"---",null,"---",null,"---"]
[67,null,null,null,null,null,"---",null,"---",null,"---",null,"---",null,"---",null,"---",null,"---"]
[68,null,null,null,null,null,"---",null,"---",null,"---",null,"---",null,"---",null,"---",null,"---"]
[69,null,null,null,null,null,"---",null,"---",null,"---",null,"---",null,"---",null,"---",null,"---"]
[70,null,null,null,null,null,"---",null,"---",null,"---",null,"---",null,"---",null,"---",null,"---"]
[71,null,null,null,null,null,"---",null,"---",null,"---",null,"---",null,"---",null,"---",null,"---"]
[72,null,null,null,null,null,"---",null,"---",null,"---",null,"---",null,"---",null,"---",null,"---"]
[73,null,null,null,null,null,"---",null,"---",null,"---",null,"---",null,"---",null,"---",null,"---"]
[74,null,null,null,null,null,"---",null,"---",null,"---",null,"---",null,"---",null,"---",null,"---"]
[75,null,null,null,null,null,"---",null,"---",null,"---",null,"---",null,"---",null,"---",null,"---"]
[76,null,null,null,null,null,"---",null,"---",null,"---",null,"---",null,"---",null,"---",null,"---"]
[77,null,null,null,null,null,"---",null,"---",null,"---",null,"---",null,"---",null,"---",null,"---"]
[78,null,null,null,null,null,"---",null,"---",null,"---",null,"---",null,"---",null,"---",null,"---"]
[79,null,null,null,null,null,"---",null,"---",null,"---",null,"---",null,"---",null,"---",null,"---"]
[80,null,null,null,null,null,"---",null,"---",null,"---",null,"---",null,"---",null,"---",null,"---"]
[81,null,null,null,null,null,"---",null,"---",null,"---",null,"---",null,"---",null,"---",null,"---"]
[82,null,null,null,null,null,"---",null,"---",null,"---",null,"---",null,"---",null,"---",null,"---"]
[83,null,null,null,null,null,"---",null,"---",null,"---",null,"---",null,"---",null,"---",null,"---"]
[84,null,null,null,null,null,"---",null,"---",null,"---",null,"---",null,"---",null,"---",null,"---"]
[85,null,null,null,null,null,"---",null,"---",null,"---",null,"---",null,"---",null,"---",null,"---"]
[86,null,null,null,null,null,"---",null,"---",null,"---",null,"---",null,"---",null,"---",null,"---"]
[87,null,null,null,null,null,"---",null,"---",null,"---",null,"---",null,"---",null,"---",null,"---"]
[88,null,null,null,null,null,"---",null,"---",null,"---",null,"---",null,"---",null,"---",null,"---"]
[89,null,null,null,null,null,"---",null,"---",null,"---",null,"---",null,"---",null,"---",null,"---"]
[90,null,null,null,null,null,"---",null,"---",null,"---",null,"---",null,"---",null,"---",null,"---"]
[91,null,null,null,null,null,"---",null,"---",null,"---",null,"---",null,"---",null,"---",null,"---"]
[92,null,null,null,null,null,"---",null,"---",null,"---",null,"---",null,"---",null,"---",null,"---"]
[93,null,null,null,null,null,"---",null,"---",null,"---",null,"---",null,"---",null,"---",null,"---"]
[94,null,null,null,null,null,"---",null,"---",null,"---",null,"---",null,"---",null,"---",null,"---"]
[95,null,null,null,null,null,"---",null,"---",null,"---",null,"---",null,"---",null,"---",null,"---"]
[96,null,null,null,null,null,"---",null,"---",null,"---",null,"---",null,"---",null,"---",null,"---"]
[97,null,null,null,null,null,"---",null,"---",null,"---",null,"---",null,"---",null,"---",null,"---"]
[98,null,null,null,null,null,"---",null,"---",null,"---",null,"---",null,"---",null,"---",null,"---"]
[99,null,null,null,null,null,"---",null,"---",null,"---",null,"---",null,"---",null,"---",null,"---"]
[100,null,null,null,null,null,"---",null,"---",null,"---",null,"---",null,"---",null,"---",null,"---"]

{"sheet":"アレルゲン","index":2,"n_rows":5,"n_cols":4,"rows_kept":5,"cut":false,"hidden":true,"merged":[]}
[1,{"$f":"VLOOKUP(D$1,対象者!$A:$S,7,FALSE)","v":{"$error":"#N/A"}},"個人番号",{"$f":"'アレルギー献立表（中） '!M3","v":0}]
[2,{"$f":"VLOOKUP(D$1,対象者!$A:$S,9,FALSE)","v":{"$error":"#N/A"}}]
[3,{"$f":"VLOOKUP(D$1,対象者!$A:$S,11,FALSE)","v":{"$error":"#N/A"}}]
[4,{"$f":"VLOOKUP(D$1,対象者!$A:$S,13,FALSE)","v":{"$error":"#N/A"}}]
[5,{"$f":"VLOOKUP(D$1,対象者!$A:$S,15,FALSE)","v":{"$error":"#N/A"}}]