{"text_format":"1","workbook":"xlsx","n_sheets":3,"sheets":["アレルギー献立表 (中学校)","対象者","アレルゲン"],"not_rendered":{"charts":0,"images":1,"macros":1,"external_links":1,"defined_names":1,"comments":0,"pivot_tables":0},"unopened":[],"bounds":{"document_bytes":16777216,"sheet_cells":100000,"rows_first":2000,"rows_last":500,"rows_between":2000,"halvings":0,"cell_chars":16384,"cell_head_chars":4096},"cells_cut":0,"cells_raw":0,"read":"whole","date_system":"1900"}

{"sheet":"アレルギー献立表 (中学校)","index":0,"n_rows":170,"n_cols":13,"rows_kept":170,"cut":false,"hidden":false,"merged":[[165,0,168,0],[9,0,24,0],[25,0,41,0],[42,0,48,0],[49,0,59,0],[67,0,83,0],[84,0,95,0],[96,0,104,0],[105,0,108,0],[125,0,139,0],[140,0,151,0],[152,0,164,0]]}
[null,{"$f":"CONCATENATE(IFERROR(VLOOKUP($M$3,対象者!$A:$O,2,FALSE),\"\"),DBCS(IFERROR(VLOOKUP($M$3,対象者!$A:$O,3,FALSE),\"\")),IFERROR(IF($M$3=\"\",\"\",\"年\"),\"\"))","v":""},{"$f":"IFERROR(VLOOKUP($M$3,対象者!$A:$O,4,FALSE),\"\")","v":""},{"$f":"IFERROR(VLOOKUP($M$3,対象者!$A:$O,5,FALSE),\"\")","v":""},null,null,null,null,null,null,null," "]
[null,{"$f":"CONCATENATE(IFERROR(VLOOKUP($M$3,対象者!$A:$O,6,FALSE),\"\"),\" \",IFERROR(VLOOKUP($M$3,対象者!$A:$O,7,FALSE),\"\"))","v":" "},{"$f":"CONCATENATE(IFERROR(VLOOKUP($M$3,対象者!$A:$O,8,FALSE),\"\"),\" \",IFERROR(VLOOKUP($M$3,対象者!$A:$O,9,FALSE),\"\"))","v":" "},{"$f":"CONCATENATE(IFERROR(VLOOKUP($M$3,対象者!$A:$O,10,FALSE),\"\"),\" \",IFERROR(VLOOKUP($M$3,対象者!$A:$O,11,FALSE),\"\"))","v":" "},{"$f":"CONCATENATE(IFERROR(VLOOKUP($M$3,対象者!$A:$O,12,FALSE),\"\"),\" \",IFERROR(VLOOKUP($M$3,対象者!$A:$O,13,FALSE),\"\"))","v":" "},{"$f":"CONCATENATE(IFERROR(VLOOKUP($M$3,対象者!$A:$O,14,FALSE),\"\"),\" \",IFERROR(VLOOKUP($M$3,対象者!$A:$O,15,FALSE),\"\"))","v":" "},null,null,null,null,null," ","番号"]
["令和７年度　３月アレルギー献立表（通常献立、アレルギー給食献立）",null,null,null,null,null,null,null,null,null,"中学校－１"," "]
["　１　通常給食を食べている人（一部を無配膳対応としている人を含む）は、「通常給食」欄を確認してください。",null,null,null,null,null,null,null,null,null,null," "]
["　２　アレルギー給食（卵･乳･えび･かにを除去した給食）を食べている人は、「アレルギー給食」欄を確認してください。ただし、通常給食とアレルギー給食の献立内容が同じ場合は、アレルギー給食の欄は空欄としています。",null,null,null,null,null,null,null,null,null,null," "]
["日","2026-03-02",null,"2026-03-03",null,"2026-03-04",null,"2026-03-05",null,"2026-03-09",null," "]
["主食","ごはん",null,"ごはん",null,"◎●⑦あいちの米粉パン",null,"ごはん",null,"麦ごはん",null," "]
["牛乳","◎牛乳",null,"◎牛乳",null,"◎はっこう乳",null,"◎牛乳",null,"◎牛乳",null," "]
[null,"通常給食","アレルギー給食\n(卵･乳･えび･かに除去)","通常給食","アレルギー給食\n(卵･乳･えび･かに除去)","通常給食","アレルギー給食\n(卵･乳･えび･かに除去)","通常給食","アレルギー給食\n(卵･乳･えび･かに除去)","通常給食","アレルギー給食\n(卵･乳･えび･かに除去)"," "]
["食缶","【えがおの\n　カレーシチュー】",null,"【みつば入り五目汁】",null,"【野菜スープ】",null,"【白みそ汁】",null,"【春雨スープ】",null," "]
[null,"　たまねぎ(52)",null,"⑦豆腐(39)",null,"　じゃがいも(39)",null,"⑦豆腐(39)",null,"　たまねぎ(39)",null," "]
[null,"　じゃがいも(45.5)",null,"　大根(26)",null,"　たまねぎ(32.5)",null,"　大根(26)",null,"　たけのこ(19.5)",null," "]
[null,"⑩豚肉(13)",null,"⑧鶏肉(26)",null,"⑩ベーコン(19.5)",null,"　かまぼこ(13)",null,"①いか(19.5)",null," "]
[null,"　にんじん(19.5)",null,"　にんじん(13)",null,"　もやし(13)",null,"　にんじん(13)",null,"⑩豚肉(13)",null," "]
[null,"　マッシュルーム(6.5)",null,"　小松菜(9.1)",null,"　にんじん(13)",null,"　小松菜(13)",null,"　にんじん(13)",null," "]
[null,"　にんにく(0.13)",null,"　みつば(3.9)",null,"　エリンギ(13)",null,"　えのきたけ(6.5)",null,"　チンゲンサイ(13)",null," "]
[null,"　カレールウ\n　　[えがお](16.9)",null,"　しいたけ(1.3)",null,"　パセリ(0.04)",null,"⑦油揚げ(3.9)",null,"　はるさめ(4.55)",null," "]
[null,"　ソース(3.25)",null,"●⑦しょうゆ(5.2)",null,"　白ワイン(2.6)",null,"⑦米みそ(11.7)",null,"⑧⑩中華ガラ\n　スープの素(4.55)",null," "]
[null,"　野菜ブイヨン(1.3)",null,"　本みりん(1.3)",null,"　野菜ブイヨン(1.95)",null,"　本みりん(1.3)",null,"　酒(2.86)",null," "]
[null,"　トマトケチャップ(2.6)",null,"　塩(0.39)",null,"●⑦しょうゆ(1.04)",null,"　だし",null,"●⑦しょうゆ(1.76)",null," "]
[null,"●⑦しょうゆ(0.65)",null,"　だし",null,"　オリーブ油(0.65)",null,"",null,"　塩(0.2)",null," "]
[null,"　純カレー(0.13)",null,"",null,"　塩(0.26)",null,"",null,"　こしょう(0.03)",null," "]
[null,"　塩(0.13)",null,"",null,"　こしょう(0.03)",null,"",null,"",null," "]
[null,"　こしょう(0.03)",null,"",null,"　ローリエ(0.01)",null,"",null,"",null," "]
[null,"",null,"",null,"",null,"",null,"",null," "]
["フライ缶","【菜花のサラダ】",null,"【まぐろの甘辛煮】",null,"【やきそば】",null,"【ヒレカツ】",null,"【バンバンジー\n　　　　　サラダ】",null," "]
[null,"　キャベツ(32.5)",null,"　まぐろ油漬け(58.5)",null,"　キャベツ(39)",null,"　ヒレカツ(50)",null,"　きゅうり(39)",null," "]
[null,"　菜花(10.4)",null,"　キャベツ(15.6)",null,"　油そば(39)",null,"　米油(5)",null,"⑧鶏肉(26)",null," "]
[null,"　まぐろ油漬け(13)",null,"　しょうが(1.3)",null,"⑩豚肉(26)",null,"",null,"　とうもろこし(13)",null," "]
[null,"　きゅうり(19.5)",null,"　砂糖(3.9)",null,"①いか(13)",null,"《ヒレカツ》",null,"　にんじん(6.5)",null," "]
[null,"　砂糖(1.3)",null,"●⑦しょうゆ(1.95)",null,"　にんじん(13)",null,"⑩豚肉",null,"④白ねりごま(3.9)",null," "]
[null,"　ワインビネガー(1.3)",null,"　本みりん(1.3)",null,"　しょうが酢漬け(0.39)",null,"●パン粉",null,"④白すりごま(1.3)",null," "]
[null,"●⑦しょうゆ(1.04)",null,"　酒(1.3)",null,"　青のり粉(0.07)",null,"⑦大豆たん白",null,"●⑦しょうゆ(2.34)",null," "]
[null,"　オリーブ油(0.65)",null,"",null,"　中濃ソース(9.1)",null,"　調味料等",null,"　砂糖(1.95)",null," "]
[null,"　塩(0.13)",null,"",null,"　ソース(3.9)",null,"",null,"　米酢(1.3)",null," "]
[null,"　こしょう(0.01)",null,"",null,"　塩(0.26)",null,"",null,"④ごま油(0.65)",null," "]
[null,"",null,"",null,"　こしょう(0.03)",null,"",null,"",null," "]
[null,null,null,null,null,null,null,null,null,null,null," "]
[null,null,null,null,null,"《油そば》",null,null,null,null,null," "]
[null,null,null,null,null,"●小麦粉",null,null,null,null,null," "]
[null,null,null,null,null,"⑦調味料等",null,null,null,null,null," "]
[null,"",null,"",null,"",null,"",null,"",null," "]
["あえ物・果物","",null,"【きざみたくあん】",null,"",null,"【ボイルキャベツ】",null,"",null," "]
[null,"",null,"　たくあん漬け(16.9)",null,"",null,"　キャベツ(32.5)",null,"",null," "]
[null,"",null,"",null,"",null,"　塩(0.65)",null,"",null," "]
[null,null,null,"《たくあん漬け》",null,null,null,null,null,null,null," "]
[null,null,null,"　大根",null,null,null,null,null,null,null," "]
[null,null,null,"●⑦調味料等",null,null,null,null,null,null,null," "]
[null,"",null,"",null,"",null,"",null,"",null," "]
["その他","",null,"【手巻きのり】",null,"【いわしの干し小魚】",null,"【小袋中濃ソース】",null,"【ベビーチーズ】",null," "]
[null,"",null,"　手巻きのり(3)",null,"　いわしの干し小魚(5)",null,"⑦⑬中濃ソース(8)",null,"◎ベビーチーズ(10)",null," "]
[null,null,null,null,null,null,null,null,null,null,null," "]
[null,null,null,"【いがまんじゅう】",null,null,null,null,null,null,null," "]
[null,null,null,"　いがまんじゅう(40)",null,null,null,null,null,null,null," "]
[null,null,null,null,null,null,null,null,null,null,null," "]
[null,null,null,"《いがまんじゅう》",null,null,null,null,null,null,null," "]
[null,"",null,"　小豆",null,"",null,"【いちごのスティックケーキ】",null,"",null," "]
[null,"",null,"　米粉",null,"",null,"⑦米粉のいちごスティックケーキ(25)",null,"",null," "]
[null,null,null,"⑦⑮調味料等",null,null,null,null,null,null,null," "]
[null,null,null,null,null,null,null,null,null,null,null," "]
["　",null,null,null,null,null,null,null,null,null,"（　）内は純使用量　単位：グラム"," "]
["　",null,null,null,null,null,null,null,null,null,null," "]
["　",null,null,null,null,null,null,null,null,null,"中学校－２"," "]
["日","2026-03-10",null,"2026-03-11",null,"2026-03-12",null,"2026-03-13",null,"2026-03-16",null," "]
["主食","●中華めん",null,"麦ごはん",null,"ごはん",null,"◎●⑦スライスパン",null,"麦ごはん",null," "]
["牛乳","◎牛乳",null,"◎牛乳",null,"◎牛乳",null,"◎牛乳",null,"◎牛乳",null," "]
[null,"通常給食","アレルギー給食\n(卵･乳･えび･かに除去)","通常給食","アレルギー給食\n(卵･乳･えび･かに除去)","通常給食","アレルギー給食\n(卵･乳･えび･かに除去)","通常給食","アレルギー給食\n(卵･乳･えび･かに除去)","通常給食","アレルギー給食\n(卵･乳･えび･かに除去)"," "]
["食缶","【とんこつラーメン\n　　　　のスープ】",null,"【だご汁】",null,"【肉じゃが】",null,"【コーンポタージュ】","【＊コーン\n　　　ポタージュ】","【スープカレー】","【＊スープカレー】"," "]
[null,"⑩豚肉(26)",null,"●すいとん(39)",null,"　じゃがいも(117)",null,"　たまねぎ(52)","　たまねぎ(52)","　たまねぎ(52)","　たまねぎ(65)"," "]
[null,"　キャベツ(26)",null,"　はくさい(26)",null,"　たまねぎ(52)",null,"　クリームコーン(39)","　クリームコーン(39)","　じゃがいも(45.5)","　じゃがいも(52)"," "]
[null,"　もやし(26)",null,"⑩豚肉(15.6)",null,"　こんにゃく(26)",null,"◎牛乳(39)","⑦豆乳(39)","○うずら卵(32.5)","⑧鶏肉(39)"," "]
[null,"　たまねぎ(19.5)",null,"　大根(13)",null,"　にんじん(26)",null,"　じゃがいも(26)","　じゃがいも(26)","⑧鶏肉(32.5)","　にんじん(19.5)"," "]
[null,"　にんじん(13)",null,"　にんじん(13)",null,"⑩豚肉(19.5)",null,"⑧鶏肉(19.5)","⑧鶏肉(19.5)","　にんじん(13)","　セロリ(3.9)"," "]
[null,"　ねぎ(13)",null,"　ねぎ(10.4)",null,"⑦枝豆(5.2)",null,"　にんじん(13)","　にんじん(13)","　セロリ(3.9)","　きくらげ(0.13)"," "]
[null,"　しょうが(1.3)",null,"　ぶなしめじ(6.5)",null,"●⑦しょうゆ(5.85)",null,"　ホワイトルウ\n　　　[えがお](7.8)","　ホワイトルウ\n　　　[えがお](7.8)","　きくらげ(0.13)","　にんにく(0.13)"," "]
[null,"　にんにく(0.39)",null,"　しいたけ(1.3)",null,"　砂糖(3.9)",null,"◎脱脂粉乳(2.6)","　パセリ(0.04)","　にんにく(0.13)","　しょうが(0.13)"," "]
[null,"⑩豚骨ラーメン\n　　　スープ(14.3)",null,"●⑦しょうゆ(5.2)",null,"　本みりん(1.3)",null,"◎チーズ(1.3)","⑦⑩洋風だしの素(1.95)","　しょうが(0.13)","　トマトピューレ(13)"," "]
[null,"●⑦しょうゆ(3.25)",null,"　塩(0.39)",null,"　塩(0.26)",null,"　パセリ(0.04)","　白ワイン(1.3)","　トマトピューレ(13)","　中濃ソース(3.25)"," "]
[null,"　でん粉(1.04)",null,"　だし",null,"　こしょう(0.03)",null,"⑦⑩洋風だしの素(1.3)","　塩(0.78)","　中濃ソース(3.25)","⑧コンソメ(0.65)"," "]
[null,null,null,"",null,"",null,"◎バター(1.3)","　こしょう(0.03)","⑧コンソメ(0.65)","　純カレー(0.65)"," "]
[null,null,null,"",null,"",null,"　白ワイン(1.3)",null,"　純カレー(0.65)","　塩(0.26)"," "]
[null,null,null,"",null,"",null,"　塩(0.78)",null,"　塩(0.26)","　こしょう(0.01)"," "]
[null,"",null,"",null,"",null,"　こしょう(0.03)",null,"　こしょう(0.01)",null," "]
[null,"",null,"",null,"",null,"",null,"",null," "]
["フライ缶","【愛知の野菜入り\n　　　　　　春巻き】",null,"【白身魚の\n　　　野菜だれかけ】",null,"【いわしの梅煮】",null,"【キャベツと\n　ウインナーの\n　　　　　ソテー】",null,"【れんこんと\n　　ツナの炒めもの】",null," "]
[null,"　春巻き(60)",null,"　米粉パンガシウス\n　　　　フライ(60)",null,"　いわしの梅煮(50)",null,"　キャベツ(45.5)",null,"　れんこん(39)",null," "]
[null,"　米油(6)",null,"　米油(6)",null,"",null,"⑩ポーク\n　ウインナー(32.5)",null,"　まぐろ油漬け(18.2)",null," "]
[null,"",null,"　たまねぎ(13)",null,"《いわしの梅煮》",null,"　にんじん(6.5)",null,"　にんじん(6.5)",null," "]
[null,"《春巻き》",null,"　にんじん(3.9)",null,"　いわし",null,"　米油(0.65)",null,"　さやいんげん(3.9)",null," "]
[null,"　キャベツ",null,"●⑦しょうゆ(3.51)",null,"　しそ抽出液",null,"　塩(0.26)",null,"●⑦しょうゆ(3.9)",null," "]
[null,"●小麦粉",null,"　砂糖(1.82)",null,"●⑦調味料等",null,"　こしょう(0.03)",null,"　本みりん(1.95)",null," "]
[null,"　れんこん",null,"　本みりん(1.3)",null,"",null,"",null,"　砂糖(1.04)",null," "]
[null,"⑧鶏肉",null,"　でん粉(0.39)",null,"",null,"",null,"④ごま油(0.65)",null," "]
[null,"　にんじん",null,null,null,null,null,null,null,null,null," "]
[null,"●④⑦調味料等",null,null,null,null,null,null,null,null,null," "]
[null,"",null,"",null,"",null,"",null,"",null," "]
["あえ物・果物","【にんじんのナムル】",null,"",null,"",null,"",null,"",null," "]
[null,"　にんじん(32.5)",null,"",null,"",null,"",null,"",null," "]
[null,"　まぐろ油漬け(6.5)",null,"",null,"",null,"",null,"",null," "]
[null,"④白すりごま(1.3)",null,"",null,"",null,"",null,"",null," "]
[null,"●⑦しょうゆ(1.3)",null,"",null,"",null,"",null,"",null," "]
[null,"　砂糖(0.65)",null,"",null,"",null,"",null,"",null," "]
[null,"　米酢(0.65)",null,"",null,"",null,"",null,"",null," "]
[null,"④ごま油(0.13)",null,"",null,"",null,"",null,"",null," "]
[null,"",null,"",null,"",null,"",null,"",null," "]
["その他","",null,"",null,"",null,"【みかんジャム】",null,"【ヨーグルト】",null," "]
[null,"",null,"",null,"",null,"　みかんジャム(15)",null,"◎ヨーグルト(100)",null," "]
[null,"",null,"",null,"",null,"",null,"",null," "]
[null,"",null,"",null,"",null,"",null,"",null," "]
["　",null,null,null,null,null,null,null,null,null,"（　）内は純使用量　単位：グラム"," "]
["※","アレルギー物質の21品目について、次のように表示しています。",null,null,null,null,null,null,null,null,null," "]
["　","○…卵","◎…乳","●…小麦","△…えび","▲…かに",null,"※　春日井市食育推進給食会ホームページに、当市が表示するアレルゲン21品目",null,null,null," "]
["　","①…いか","②…オレンジ","③…牛肉","④…ごま","⑤…さけ",null,"　 のアレルギーマークを検索して強調表示する機能を持つ「マーク強調機能付",null,null,null," "]
["　","⑥…さば","⑦…大豆","⑧…鶏肉","⑨…バナナ","⑩…豚肉",null,"　 アレルギー献立表」を掲載しています。",null,null,null," "]
["　","⑪…もも","⑫…やまいも","⑬…りんご","⑭…ゼラチン",null,null,"　　　https://www.kasugai-kyushoku.com/kondatehyou/allergy_mark/",null,null,null," "]
["　","⑮…種実（ぎんなん・くり・ココナッツ）",null,null,"⑯…貝（あさり・ほたて等）",null,null,null,null,null,null," "]
["１","パンに表示される⑦大豆については、添加物のレシチンに含まれる微量のアレルゲンを示します。",null,null,null,null,null,null,null,null,null," "]
["２","アレルギー献立表の見方については、「保存版ＮＯ．１」を参照してください。",null,null,null,null,null,null,null,null,null," "]
["３","「むろ削り」または「和風だしの素」については、「だし」と表記しています。",null,null,null,null,null,null,null,null,null," "]
["　",null,null,null,null,null,null,null,null,null,null," "]
{"$rows_left_out":51}
{"sheet":"対象者","index":1,"n_rows":101,"n_cols":21,"rows_kept":101,"cut":false,"hidden":true,"merged":[]}
["番号","学校","学年","組","氏名","アレ１","１記号","アレ２","２記号","アレ３","３記号","アレ４","４記号","アレ５","５記号","アレ６","６記号","アレ７","７記号",1,"アレルゲンはドロップダウンリストから選択してください。"]
[1,null,null,null,null,null,"---",null,"---",null,"---",null,"---",null,"---",null,"---",null,"---",2,"アレルギー献立表に表示可能なアレルゲンは５種類までとなります。※６、７は参考入力"]
[2,null,null,null,null,null,"---",null,"---",null,"---",null,"---",null,"---",null,"---",null,"---","※","５種類を超えるアレルゲンのある場合は、弁当持参を促すべき児童生徒と言えます。"]
[3,null,null,null,null,null,"---",null,"---",null,"---",null,"---",null,"---",null,"---",null,"---",3,"このリストをアレルギー献立表の「対象者」シートにコピーして「値のみ」を貼り付けてください。"]
[4,null,null,null,null,null,"---",null,"---",null,"---",null,"---",null,"---",null,"---",null,"---",4,"対象者を100人以上登録したいときは、A100～R101を選択してコピー（又はオートフィル）してください。"]
[5,null,null,null,null,null,"---",null,"---",null,"---",null,"---",null,"---",null,"---",null,"---"]
[6,null,null,null,null,null,"---",null,"---",null,"---",null,"---",null,"---",null,"---",null,"---"]
[7,null,null,null,null,null,"---",null,"---",null,"---",null,"---",null,"---",null,"---",null,"---"]
[8,null,null,null,null,null,"---",null,"---",null,"---",null,"---",null,"---",null,"---",null,"---"]
[9,null,null,null,null,null,"---",null,"---",null,"---",null,"---",null,"---",null,"---",null,"---"]
[10,null,null,null,null,null,"---",null,"---",null,"---",null,"---",null,"---",null,"---",null,"---"]
[11,null,null,null,null,null,"---",null,"---",null,"---",null,"---",null,"---",null,"---",null,"---"]
[12,null,null,null,null,null,"---",null,"---",null,"---",null,"---",null,"---",null,"---",null,"---"]
[13,null,null,null,null,null,"---",null,"---",null,"---",null,"---",null,"---",null,"---",null,"---"]
[14,null,null,null,null,null,"---",null,"---",null,"---",null,"---",null,"---",null,"---",null,"---"]
[15,null,null,null,null,null,"---",null,"---",null,"---",null,"---",null,"---",null,"---",null,"---"]
[16,null,null,null,null,null,"---",null,"---",null,"---",null,"---",null,"---",null,"---",null,"---"]
[17,null,null,null,null,null,"---",null,"---",null,"---",null,"---",null,"---",null,"---",null,"---"]
[18,null,null,null,null,null,"---",null,"---",null,"---",null,"---",null,"---",null,"---",null,"---"]
[19,null,null,null,null,null,"---",null,"---",null,"---",null,"---",null,"---",null,"---",null,"---"]
[20,null,null,null,null,null,"---",null,"---",null,"---",null,"---",null,"---",null,"---",null,"---"]
[21,null,null,null,null,null,"---",null,"---",null,"---",null,"---",null,"---",null,"---",null,"---"]
[22,null,null,null,null,null,"---",null,"---",null,"---",null,"---",null,"---",null,"---",null,"---"]
[23,null,null,null,null,null,"---",null,"---",null,"---",null,"---",null,"---",null,"---",null,"---"]
[24,null,null,null,null,null,"---",null,"---",null,"---",null,"---",null,"---",null,"---",null,"---"]
[25,null,null,null,null,null,"---",null,"---",null,"---",null,"---",null,"---",null,"---",null,"---"]
[26,null,null,null,null,null,"---",null,"---",null,"---",null,"---",null,"---",null,"---",null,"---"]
[27,null,null,null,null,null,"---",null,"---",null,"---",null,"---",null,"---",null,"---",null,"---"]
[28,null,null,null,null,null,"---",null,"---",null,"---",null,"---",null,"---",null,"---",null,"---"]
[29,null,null,null,null,null,"---",null,"---",null,"---",null,"---",null,"---",null,"---",null,"---"]
[30,null,null,null,null,null,"---",null,"---",null,"---",null,"---",null,"---",null,"---",null,"---"]
[31,null,null,null,null,null,"---",null,"---",null,"---",null,"---",null,"---",null,"---",null,"---"]
[32,null,null,null,null,null,"---",null,"---",null,"---",null,"---",null,"---",null,"---",null,"---"]
[33,null,null,null,null,null,"---",null,"---",null,"---",null,"---",null,"---",null,"---",null,"---"]
[34,null,null,null,null,null,"---",null,"---",null,"---",null,"---",null,"---",null,"---",null,"---"]
[35,null,null,null,null,null,"---",null,"---",null,"---",null,"---",null,"---",null,"---",null,"---"]
[36,null,null,null,null,null,"---",null,"---",null,"---",null,"---",null,"---",null,"---",null,"---"]
[37,null,null,null,null,null,"---",null,"---",null,"---",null,"---",null,"---",null,"---",null,"---"]
[38,null,null,null,null,null,"---",null,"---",null,"---",null,"---",null,"---",null,"---",null,"---"]
[39,null,null,null,null,null,"---",null,"---",null,"---",null,"---",null,"---",null,"---",null,"---"]
[40,null,null,null,null,null,"---",null,"---",null,"---",null,"---",null,"---",null,"---",null,"---"]
[41,null,null,null,null,null,"---",null,"---",null,"---",null,"---",null,"---",null,"---",null,"---"]
[42,null,null,null,null,null,"---",null,"---",null,"---",null,"---",null,"---",null,"---",null,"---"]
[43,null,null,null,null,null,"---",null,"---",null,"---",null,"---",null,"---",null,"---",null,"---"]
[44,null,null,null,null,null,"---",null,"---",null,"---",null,"---",null,"---",null,"---",null,"---"]
[45,null,null,null,null,null,"---",null,"---",null,"---",null,"---",null,"---",null,"---",null,"---"]
[46,null,null,null,null,null,"---",null,"---",null,"---",null,"---",null,"---",null,"---",null,"---"]
[47,null,null,null,null,null,"---",null,"---",null,"---",null,"---",null,"---",null,"---",null,"---"]
[48,null,null,null,null,null,"---",null,"---",null,"---",null,"---",null,"---",null,"---",null,"---"]
[49,null,null,null,null,null,"---",null,"---",null,"---",null,"---",null,"---",null,"---",null,"---"]
[50,null,null,null,null,null,"---",null,"---",null,"---",null,"---",null,"---",null,"---",null,"---"]
[51,null,null,null,null,null,"---",null,"---",null,"---",null,"---",null,"---",null,"---",null,"---"]
[52,null,null,null,null,null,"---",null,"---",null,"---",null,"---",null,"---",null,"---",null,"---"]
[53,null,null,null,null,null,"---",null,"---",null,"---",null,"---",null,"---",null,"---",null,"---"]
[54,null,null,null,null,null,"---",null,"---",null,"---",null,"---",null,"---",null,"---",null,"---"]
[55,null,null,null,null,null,"---",null,"---",null,"---",null,"---",null,"---",null,"---",null,"---"]
[56,null,null,null,null,null,"---",null,"---",null,"---",null,"---",null,"---",null,"---",null,"---"]
[57,null,null,null,null,null,"---",null,"---",null,"---",null,"---",null,"---",null,"---",null,"---"]
[58,null,null,null,null,null,"---",null,"---",null,"---",null,"---",null,"---",null,"---",null,"---"]
[59,null,null,null,null,null,"---",null,"---",null,"---",null,"---",null,"---",null,"---",null,"---"]
[60,null,null,null,null,null,"---",null,"---",null,"---",null,"---",null,"---",null,"---",null,"---"]
[61,null,null,null,null,null,"---",null,"---",null,"---",null,"---",null,"---",null,"---",null,"---"]
[62,null,null,null,null,null,"---",null,"---",null,"---",null,"---",null,"---",null,"---",null,"---"]
[63,null,null,null,null,null,"---",null,"---",null,"---",null,"---",null,"---",null,"---",null,"---"]
[64,null,null,null,null,null,"---",null,"---",null,"---",null,"---",null,"---",null,"---",null,"---"]
[65,null,null,null,null,null,"---",null,"---",null,"---",null,"---",null,"---",null,"---",null,"---"]
[66,null,null,null,null,null,"---",null,"---",null,"---",null,"---",null,"---",null,"---",null,"---"]
[67,null,null,null,null,null,"---",null,"---",null,"---",null,"---",null,"---",null,"---",null,"---"]
[68,null,null,null,null,null,"---",null,"---",null,"---",null,"---",null,"---",null,"---",null,"---"]
[69,null,null,null,null,null,"---",null,"---",null,"---",null,"---",null,"---",null,"---",null,"---"]
[70,null,null,null,null,null,"---",null,"---",null,"---",null,"---",null,"---",null,"---",null,"---"]
[71,null,null,null,null,null,"---",null,"---",null,"---",null,"---",null,"---",null,"---",null,"---"]
[72,null,null,null,null,null,"---",null,"---",null,"---",null,"---",null,"---",null,"---",null,"---"]
[73,null,null,null,null,null,"---",null,"---",null,"---",null,"---",null,"---",null,"---",null,"---"]
[74,null,null,null,null,null,"---",null,"---",null,"---",null,"---",null,"---",null,"---",null,"---"]
[75,null,null,null,null,null,"---",null,"---",null,"---",null,"---",null,"---",null,"---",null,"---"]
[76,null,null,null,null,null,"---",null,"---",null,"---",null,"---",null,"---",null,"---",null,"---"]
[77,null,null,null,null,null,"---",null,"---",null,"---",null,"---",null,"---",null,"---",null,"---"]
[78,null,null,null,null,null,"---",null,"---",null,"---",null,"---",null,"---",null,"---",null,"---"]
[79,null,null,null,null,null,"---",null,"---",null,"---",null,"---",null,"---",null,"---",null,"---"]
[80,null,null,null,null,null,"---",null,"---",null,"---",null,"---",null,"---",null,"---",null,"---"]
[81,null,null,null,null,null,"---",null,"---",null,"---",null,"---",null,"---",null,"---",null,"---"]
[82,null,null,null,null,null,"---",null,"---",null,"---",null,"---",null,"---",null,"---",null,"---"]
[83,null,null,null,null,null,"---",null,"---",null,"---",null,"---",null,"---",null,"---",null,"---"]
[84,null,null,null,null,null,"---",null,"---",null,"---",null,"---",null,"---",null,"---",null,"---"]
[85,null,null,null,null,null,"---",null,"---",null,"---",null,"---",null,"---",null,"---",null,"---"]
[86,null,null,null,null,null,"---",null,"---",null,"---",null,"---",null,"---",null,"---",null,"---"]
[87,null,null,null,null,null,"---",null,"---",null,"---",null,"---",null,"---",null,"---",null,"---"]
[88,null,null,null,null,null,"---",null,"---",null,"---",null,"---",null,"---",null,"---",null,"---"]
[89,null,null,null,null,null,"---",null,"---",null,"---",null,"---",null,"---",null,"---",null,"---"]
[90,null,null,null,null,null,"---",null,"---",null,"---",null,"---",null,"---",null,"---",null,"---"]
[91,null,null,null,null,null,"---",null,"---",null,"---",null,"---",null,"---",null,"---",null,"---"]
[92,null,null,null,null,null,"---",null,"---",null,"---",null,"---",null,"---",null,"---",null,"---"]
[93,null,null,null,null,null,"---",null,"---",null,"---",null,"---",null,"---",null,"---",null,"---"]
[94,null,null,null,null,null,"---",null,"---",null,"---",null,"---",null,"---",null,"---",null,"---"]
[95,null,null,null,null,null,"---",null,"---",null,"---",null,"---",null,"---",null,"---",null,"---"]
[96,null,null,null,null,null,"---",null,"---",null,"---",null,"---",null,"---",null,"---",null,"---"]
[97,null,null,null,null,null,"---",null,"---",null,"---",null,"---",null,"---",null,"---",null,"---"]
[98,null,null,null,null,null,"---",null,"---",null,"---",null,"---",null,"---",null,"---",null,"---"]
[99,null,null,null,null,null,"---",null,"---",null,"---",null,"---",null,"---",null,"---",null,"---"]
[100,null,null,null,null,null,"---",null,"---",null,"---",null,"---",null,"---",null,"---",null,"---"]

{"sheet":"アレルゲン","index":2,"n_rows":5,"n_cols":4,"rows_kept":5,"cut":false,"hidden":true,"merged":[]}
[1,{"$f":"VLOOKUP(D$1,対象者!$A:$S,7,FALSE)","v":{"$error":"#N/A"}},"個人番号",{"$f":"'アレルギー献立表 (中学校)'!M3","v":0}]
[2,{"$f":"VLOOKUP(D$1,対象者!$A:$S,9,FALSE)","v":{"$error":"#N/A"}}]
[3,{"$f":"VLOOKUP(D$1,対象者!$A:$S,11,FALSE)","v":{"$error":"#N/A"}}]
[4,{"$f":"VLOOKUP(D$1,対象者!$A:$S,13,FALSE)","v":{"$error":"#N/A"}}]
[5,{"$f":"VLOOKUP(D$1,対象者!$A:$S,15,FALSE)","v":{"$error":"#N/A"}}]