{"text_format":"1","workbook":"xlsx","n_sheets":3,"sheets":["アレルギー献立表","対象者","アレルゲン"],"not_rendered":{"charts":0,"images":1,"macros":1,"external_links":8,"defined_names":1,"comments":0,"pivot_tables":0},"unopened":[],"bounds":{"document_bytes":16777216,"sheet_cells":100000,"rows_first":2000,"rows_last":500,"rows_between":2000,"halvings":0,"cell_chars":16384,"cell_head_chars":4096},"cells_cut":0,"cells_raw":0,"read":"whole","date_system":"1900"}

{"sheet":"アレルギー献立表","index":0,"n_rows":179,"n_cols":8,"rows_kept":179,"cut":false,"hidden":false,"merged":[[121,2,121,3],[122,2,122,3],[123,2,123,3],[173,0,176,0],[6,0,22,0],[23,0,35,0],[36,0,42,0],[43,0,48,0],[63,0,77,0],[78,0,91,0],[124,0,148,0],[149,0,164,0],[92,0,98,0],[99,0,110,0],[165,0,172,0]]}
[null,{"$f":"CONCATENATE(IFERROR(VLOOKUP($H$3,対象者!$A:$O,2,FALSE),\"\"),DBCS(IFERROR(VLOOKUP($H$3,対象者!$A:$O,3,FALSE),\"\")),IFERROR(IF($H$3=\"\",\"\",\"年\"),\"\"))","v":""},{"$f":"IFERROR(VLOOKUP($H$3,対象者!$A:$O,4,FALSE),\"\")","v":""},{"$f":"IFERROR(VLOOKUP($H$3,対象者!$A:$O,5,FALSE),\"\")","v":""},null,null," "]
[null,{"$f":"CONCATENATE(IFERROR(VLOOKUP($H$3,対象者!$A:$O,6,FALSE),\"\"),\" \",IFERROR(VLOOKUP($H$3,対象者!$A:$O,7,FALSE),\"\"))","v":" "},{"$f":"CONCATENATE(IFERROR(VLOOKUP($H$3,対象者!$A:$O,8,FALSE),\"\"),\" \",IFERROR(VLOOKUP($H$3,対象者!$A:$O,9,FALSE),\"\"))","v":" "},{"$f":"CONCATENATE(IFERROR(VLOOKUP($H$3,対象者!$A:$O,11,FALSE),\"\"))","v":""},{"$f":"CONCATENATE(IFERROR(VLOOKUP($H$3,対象者!$A:$O,12,FALSE),\"\"),\" \",IFERROR(VLOOKUP($H$3,対象者!$A:$O,13,FALSE),\"\"))","v":" "},{"$f":"CONCATENATE(IFERROR(VLOOKUP($H$3,対象者!$A:$O,14,FALSE),\"\"),\" \",IFERROR(VLOOKUP($H$3,対象者!$A:$O,15,FALSE),\"\"))","v":" "}," ","番号"]
["　","令和5年度　3月アレルギー献立表",null,null,null,"中学校－１"," "]
["日","2024-03-01","2024-03-04","2024-03-05","2024-03-07","2024-03-08"," "]
["主食","ごはん","麦ごはん","せきはん","麦ごはん","◎●⑦スライスパン"," "]
["牛乳","◎牛乳","◎牛乳","◎牛乳","◎牛乳","◎牛乳"," "]
["食缶","【えがおの\n       カレーシチュー】","【ジャーチャン\n　　　　　　ドウフ】","【五目汁】","【大根と豚肉の煮物】","【白いんげんの\n             ポタージュ】"," "]
[null,"　たまねぎ(52)　","　たまねぎ(58.5)　","⑦豆腐(39)　","　大根(65)　","　たまねぎ(45.5)　"," "]
[null,"　じゃがいも(45.5)　","⑦生揚げ(52)　","　大根(26)　","⑩豚肉(39)　","　じゃがいも(26)　"," "]
[null,"⑩豚肉(19.5)　","⑩豚肉(39)　","⑧鶏肉(13)　","　さといも(32.5)　","　白いんげん豆\n             ペースト(26)"," "]
[null,"　にんじん(19.5)　","　にんじん(19.5)　","　こんにゃく(10.4)　","○うずら卵(26)　","　にんじん(19.5)　"," "]
[null,"　マッシュルーム(6.5)　","　ねぎ(9.1)　","　ごぼう(10.4)　","　にんじん(19.5)　","　白いんげん豆(13)　"," "]
[null,"　にんにく(0.13)　","　しいたけ(0.65)　","　にんじん(10.4)　","　さやいんげん(6.5)　","⑩ベーコン(10.4)　"," "]
[null,"　カレールウ\n           [えがお](15.6)　","　しょうが(0.65)　","　ねぎ(10.4)　","●⑦しょうゆ(6.5)　","　マッシュルーム(10.4)　"," "]
[null,"⑦豆乳(13)　","●⑦しょうゆ(6.5)　","●⑦しょうゆ(5.2)　","　砂糖(3.25)　","◎牛乳(39)　"," "]
[null,"　ソース(2.6)　","⑦豆みそ(3.25)　","　本みりん(1.3)　","　酒(2.6)　","　ホワイトルウ\n              [えがお](6.5)　"," "]
[null,"　野菜ブイヨン(1.3)　","　砂糖(2.6)　","　塩(0.39)　","　本みりん(1.3)　","◎生クリーム(2.6)　"," "]
[null,"　トマトケチャップ\n                       (1.3)　","　豆板醤(0.13)　","　むろ削り(3.9)　","　和風だしの素(1.3)　","◎脱脂粉乳(2.6)　"," "]
[null,"●⑦しょうゆ(0.65)　","　でん粉(1.3)　","","","◎チーズ(2.6)　"," "]
[null,"　純カレー(0.13)　","","","","⑦⑩洋風だしの素(1.95)　"," "]
[null,"　塩(0.13)　","","","","　塩(0.65)　"," "]
[null,"　こしょう(0.03)　","","","","　こしょう(0.05)　"," "]
[null,"","","","",""," "]
["フライ缶","【菜の花入り\n             ツナサラダ】","【春雨サラダ】","【ヒレカツ】","【さば銀紙焼き】","【切り干し大根と\n       チキンのサラダ】"," "]
[null,"　キャベツ(19.5)　","　きゅうり(26)　","　ヒレカツ 1個(50)　","   さば銀紙焼き 1個(60)　","⑧サラダチキン(13)　"," "]
[null,"　菜花(19.5)　","　もやし(13)　","　米油(5)　","","　きゅうり(13)　"," "]
[null,"　まぐろ油漬け(15.6)　","　とうもろこし(13)　","","《さば銀紙焼き》","　とうもろこし(10.4)　"," "]
[null,"　とうもろこし(13)　","⑧チキンハム(10.4)　","《ヒレカツ》","⑥さば","　切り干し大根(3.9)　"," "]
[null,"　にんじん(10.4)　","　はるさめ(6.5)　","⑩豚肉","⑦調味料等","④白すりごま(2.6)　"," "]
[null,"　砂糖(1.3)　","●⑦しょうゆ(2.6)　","●パン粉","","●⑦しょうゆ(2.6)　"," "]
[null,"　ワインビネガー(1.3)　","　米酢(1.95)　","●小麦粉","","　米酢(1.3)　"," "]
[null,"●⑦しょうゆ(1.04)　","　砂糖(1.95)　","　米粉","","　砂糖(1.3)　"," "]
[null,"　オリーブ油(0.65)　","④ごま油(0.65)　","　調味料等","","　サラダ油(0.65)　"," "]
[null,"　塩(0.13)　","　塩(0.13)　","","",""," "]
[null,"　こしょう(0.01)　","　こしょう(0.01)　","","",""," "]
[null,"","","","",""," "]
["あえ物・果物","","【しらぬい】","【ボイルキャベツ】","【白菜と小松菜の\n　　　　　　和え物】",""," "]
[null,"","　しらぬい 1袋(50)　","　キャベツ(32.5)　","　はくさい(26)　",""," "]
[null,"","","　塩(0.65)　","　小松菜(13)　",""," "]
[null,"","","","　にんじん(6.5)　",""," "]
[null,"","","","●⑦しょうゆ(1.95)　",""," "]
[null,"","","","　砂糖(0.65)　",""," "]
[null,"","","","",""," "]
["その他","【ひなあられ】","","【小袋中濃ソース】","","【みかんジャム】"," "]
[null,"　ひなあられ 1袋(8)　","","⑦⑬中濃ソース 1袋(8)","","　みかんジャム 1袋(15)　"," "]
[null,"","",null,"",""," "]
[null,"","","【米粉メープル\n　　　　　マフィン】","",""," "]
[null,null,null,"⑦米粉メープル\n　　マフィン 1個(25)　",null,null," "]
[null,"","",null,"",""," "]
["　",null,null,null,null,"（　）内は純使用量　単位：グラム"," "]
["※","アレルギー物質の21品目について、次のように表示しています。",null,null,null,null," "]
["　","○…卵","◎…乳","●…小麦","△…えび","▲…かに"," "]
["　","①…いか","②…オレンジ","③…牛肉","④…ごま","⑤…さけ"," "]
["　","⑥…さば","⑦…大豆","⑧…鶏肉","⑨…バナナ","⑩…豚肉"," "]
["　","⑪…もも","⑫…やまいも","⑬…りんご","⑭…ゼラチン",null," "]
["　","⑮…種実（ぎんなん・くり・ココナッツ）",null,null,"⑯…貝（あさり・ほたて等）",null," "]
["１","パンに表示される⑦大豆については、添加物のレシチンに含まれる微量のアレルゲンを示します。",null,null,null,null," "]
["２","アレルギー献立表の見方については、「保存版ＮＯ．１」を参照してください。",null,null,null,null," "]
["　",null,null,null,null,null," "]
["　",null,null,null,null,"中学校－２"," "]
["日","2024-03-11","2024-03-12","2024-03-13","2024-03-14","2024-03-15"," "]
["主食","わかめごはん","麦ごはん","ごはん","●中華めん","麦ごはん"," "]
["牛乳","◎牛乳","◎はっこう乳","◎牛乳","◎牛乳","◎牛乳"," "]
["食缶","【だご汁】","【高野豆腐の卵とじ】","【白みそ汁】","【しょうゆラーメンの\n                   スープ】","【じゃがいもの\n                そぼろ煮】"," "]
[null,"●すいとん(39)　","○液卵(52)　","⑦豆腐(39)　","⑩豚肉(26)　","　じゃがいも(117)　"," "]
[null,"　はくさい(26)　","　たまねぎ(39)　","　大根(26)　","　もやし(26)　","⑦生揚げ(26)　"," "]
[null,"⑩豚肉(15.6)　","　じゃがいも(32.5)　","⑧鶏肉(15.6)　","　ねぎ(13)　","　たまねぎ(26)　"," "]
[null,"　大根(13)　","　にんじん(13)　","　にんじん(13)　","　たけのこ(13)　","　にんじん(19.5)　"," "]
[null,"　にんじん(13)　","⑧鶏肉(13)　","　ねぎ(13)　","　にんじん(13)　","⑧鶏肉(19.5)　"," "]
[null,"　ねぎ(10.4)　","　さやいんげん(6.5)　","　えのきたけ(10.4)　","　なると(10.4)　","⑦枝豆(6.5)　"," "]
[null,"　ぶなしめじ(6.5)　","⑦高野豆腐(6.5)　","⑦油揚げ(3.25)　","　わかめ(0.52)　","●⑦しょうゆ(6.5)　"," "]
[null,"●⑦しょうゆ(5.2)　","●⑦しょうゆ(5.2)　","⑦米みそ(11.7)　","⑧チキンブイヨン(39)　","　砂糖(3.9)　"," "]
[null,"　塩(0.39)　","　砂糖(2.6)　","　本みりん(1.3)　","●⑦しょうゆ(9.75)　","　本みりん(1.3)　"," "]
[null,"　むろ削り(3.9)　","　本みりん(1.3)　","　むろ削り(3.9)　","⑦⑧⑩⑯中華だしの素\n                   (1.95)　","　塩(0.26)　"," "]
[null,"","　塩(0.26)　","","④ごま油(0.39)　","　こしょう(0.03)　"," "]
[null,"","　むろ削り(3.25)　","","　塩(0.16)　",""," "]
[null,"","","","　こしょう(0.05)　",""," "]
[null,"","","","",""," "]
["フライ缶","【生揚げと小松菜の\n                 あんかけ】","【ちくわの\n           いそべ揚げ】","【肉野菜いため】","【愛知の野菜春巻き】","【ごぼうサラダ】"," "]
[null,"⑦生揚げ(39)　","　ちくわ 3個(60)　","⑩豚肉(45.5)　","　春巻き 1個(60)　","　ごぼう(19.5)　"," "]
[null,"⑧鶏肉(19.5)　","●小麦粉(3.9)　","　たまねぎ(19.5)　","　米油(6)　","　まぐろ油漬け(15.6)　"," "]
[null,"　にんじん(19.5)　","　でん粉(1.3)　","　にんじん(13)　","","　きゅうり(13)　"," "]
[null,"　小松菜(13)　","　青のり粉(0.16)　","　もやし(13)　","《愛知の野菜春巻き》","　にんじん(13)　"," "]
[null,"　たまねぎ(13)　","　米油(5.88)　","　にら(3.9)　","　キャベツ","④白ねりごま(2.6)　"," "]
[null,"　しょうが(0.65)　","","　しょうが(1.04)　","⑧鶏肉","④白すりごま(1.95)　"," "]
[null,"●⑦しょうゆ(3.12)　","","　にんにく(0.26)　","　れんこん","　切り干し大根(1.3)　"," "]
[null,"　砂糖(1.56)　","","●⑦しょうゆ(3.64)　","　にんじん","●⑦しょうゆ(2.6)　"," "]
[null,"　本みりん(1.3)　","","　酒(2.6)　","●小麦粉","　砂糖(1.95)　"," "]
[null,"　でん粉(0.65)　","","　砂糖(1.95)　","●④⑦調味料等","　米酢(1.95)　"," "]
[null,"","","　米油(0.65)　","","④ごま油(0.52)　"," "]
[null,"","","　でん粉(0.65)　","",""," "]
[null,"","","","",""," "]
["あえ物・果物","","【キャベツとほうれん草の\n                  おかか和え】","","【きゅうりの\n             中華和え】",""," "]
[null,"","　キャベツ(26)　","","　きゅうり(36.4)　",""," "]
[null,"","　ほうれん草(13)　","","●⑦しょうゆ(1.56)　",""," "]
[null,"","　花かつお(0.26)　","","　砂糖(1.04)　",""," "]
[null,"","●⑦しょうゆ(1.95)　","","　米酢(0.78)　",""," "]
[null,"","　砂糖(0.39)　","","④ごま油(0.52)　",""," "]
[null,"","","","",""," "]
["その他","【きらず揚げ】","","【プルーン】","","【ヨーグルト】"," "]
[null,"　きらず揚げ 1袋(8)　","","　プルーン 1袋(20)　","","◎ヨーグルト 1個(80)　"," "]
[null,null,null,null,null,null," "]
[null,"《きらず揚げ》",null,null,null,null," "]
[null,"●小麦粉",null,null,null,null," "]
[null,"⑦おからパウダー",null,"","",""," "]
[null,"　調味料等",null,"","",""," "]
[null,null,null,null,null,null," "]
[null,null,null,null,null,null," "]
[null,null,null,null,null,null," "]
[null,"","","","",""," "]
[null,"","","","",""," "]
["　",null,null,null,null,"（　）内は純使用量　単位：グラム"," "]
[null,null,null,null,null,null," "]
[null,null,null,null,null,null," "]
[null,null,null,null,null,null," "]
[null,null,null,null,null,null," "]
[null,null,null,null,null,null," "]
[null,null,null,null,null,null," "]
[null,null,null,null,null,null," "]
["　",null,null,null,null,null," "]
["　",null,null,null,null,"中学校－３"," "]
["日","2024-03-18","2024-03-19",null,"2024-03-21",null," "]
["主食","ごはん","―",null,"◎●⑦あいちの米粉\n                        パン",null," "]
["牛乳","◎牛乳","◎牛乳",null,"◎牛乳",null," "]
["食缶","【みつば入り\n             かきたま汁】","【ツナの炊き込み\n                   ご飯】","【さわにわん】","【ミートソース\n               ペンネ】",null," "]
[null,"⑦豆腐(39)　","　米(60)　","⑩豚肉(26)　","　たまねぎ(52)　",null," "]
[null,"○液卵(26)　","　もち米(12)　","⑫ながいも(19.5)　","　トマト(26)　",null," "]
[null,"⑧鶏肉(26)　","　こんにゃく(18)　","　かまぼこ(13)　","●マカロニ(23.4)　",null," "]
[null,"　たまねぎ(19.5)　","　まぐろ油漬け(18)　","　にんじん(13)　","⑩豚肉(19.5)　",null," "]
[null,"　かまぼこ(13)　","　にんじん(18)　","　たけのこ(13)　","⑦大豆(13)　",null," "]
[null,"　にんじん(6.5)　","　ぶなしめじ(12)　","　ごぼう(13)　","　にんじん(13)　",null," "]
[null,"　みつば(3.9)　","⑦油揚げ(2.4)　","　ねぎ(13)　","　マッシュルーム(6.5)　",null," "]
[null,"●⑦しょうゆ(5.2)　","●⑦しょうゆ(7.2)　","●⑦しょうゆ(5.2)　","　にんにく(0.65)　",null," "]
[null,"　塩(0.39)　","　酒(2.4)　","　塩(0.39)　","　パセリ(0.07)　",null," "]
[null,"　でん粉(1.3)　","　砂糖(1.8)　","　こしょう(0.03)　","　トマトケチャップ\n　　　　　　　(19.5)　",null," "]
[null,"　むろ削り(3.9)　","　本みりん(1.2)　","　むろ削り(3.9)　","　デミグラスソース\n　　　　　　　(10.4)　",null," "]
[null,"","　和風だしの素(1.2)　",null,"⑧チキンブイヨン(15.6)　",null," "]
[null,"","　塩(0.24)　",null,"　ソース(3.9)　",null," "]
[null,"","",null,"　赤ワイン(1.3)　",null," "]
[null,"",null,null,"　砂糖(1.3)　",null," "]
[null,"",null,null,"　オリーブ油(0.65)　",null," "]
[null,"",null,null,"　塩(0.39)　",null," "]
[null,"",null,null,"　こしょう(0.04)　",null," "]
[null,"",null,null,null,null," "]
[null,"",null,null,"《デミグラスソース》",null," "]
[null,"",null,null,"●小麦粉",null," "]
[null,"",null,null,"　トマトペースト",null," "]
[null,"",null,null,"⑧⑩調味料等",null," "]
[null,null,null,null,null,null," "]
["フライ缶","【いわしの\n           しょうが煮】","【鶏肉のから揚げ】",null,"【ブロッコリー\n                 サラダ】",null," "]
[null,"　いわしのしょうが煮\n　　　　　　 1個(50)　","⑧鶏肉 1個(60)",null,"　ブロッコリー(26)",null," "]
[null,null,"　しょうが(0.5)",null,"　キャベツ(13)　",null," "]
[null,"《いわしの\n　　　　しょうが煮》","●⑦しょうゆ(3)　",null,"　きゅうり(13)　",null," "]
[null,"　いわし","　酒(1.5)　",null,"⑧サラダチキン(10.4)　",null," "]
[null,"●⑦調味料等","　でん粉(6)",null,"　にんじん(10.4)　",null," "]
[null,"","●小麦粉(2)",null,"    卵なしマヨネーズ\n　　　　　　　(7.8)",null," "]
[null,"","　米油(6.8)　",null,"●⑦しょうゆ(1.3)　",null," "]
[null,"",null,null,"　塩(0.07)　",null," "]
[null,"",null,null,"　こしょう(0.01)　",null," "]
[null,null,null,null,null,null," "]
[null,null,null,null,"《卵なしマヨネーズ》",null," "]
[null,null,null,null,"⑦大豆粉",null," "]
[null,null,null,null,"⑦粉末状植物性たん白",null," "]
[null,null,null,null,"　調味料等",null," "]
[null,null,null,null,null,null," "]
["あえ物・果物","【キャベツの\n             塩昆布和え】","【もやしとほうれん草のごま和え】\n",null,"",null," "]
[null,"　キャベツ(32.5)　","　もやし(26)　",null,"",null," "]
[null,"　塩昆布(1.56)　","　ほうれん草(13)　",null,"",null," "]
[null,"","④白すりごま(0.6)　",null,"",null," "]
[null,"《塩昆布》","④白ごま(0.4)　",null,"",null," "]
[null,"　昆布","●⑦しょうゆ(1.3)",null,"",null," "]
[null,"●⑦調味料等","　砂糖(0.4)",null,"",null," "]
[null,"",null,null,"",null," "]
["その他","","【いちごゼリー】",null,"",null," "]
[null,"","　いちごゼリー 1個(50)",null,"",null," "]
[null,"",null,null,"",null," "]
[null,"",null,null,"",null," "]
[null,null,"",null,"（　）内は純使用量　単位：グラム",null," "]
[null,null,"",""]

{"sheet":"対象者","index":1,"n_rows":101,"n_cols":21,"rows_kept":101,"cut":false,"hidden":true,"merged":[]}
["番号","学校","学年","組","氏名","アレ１","１記号","アレ２","２記号","アレ３","３記号","アレ４","４記号","アレ５","５記号","アレ６","６記号","アレ７","７記号",1,"アレルゲンはドロップダウンリストから選択してください。"]
[1,null,null,null,null,null,"---",null,"---",null,"---",null,"---",null,"---",null,"---",null,"---",2,"アレルギー献立表に表示可能なアレルゲンは５種類までとなります。※６、７は参考入力"]
[2,null,null,null,null,null,"---",null,"---",null,"---",null,"---",null,"---",null,"---",null,"---","※","５種類を超えるアレルゲンのある場合は、弁当持参を促すべき児童生徒と言えます。"]
[3,null,null,null,null,null,"---",null,"---",null,"---",null,"---",null,"---",null,"---",null,"---",3,"このリストをアレルギー献立表の「対象者」シートにコピーして「値のみ」を貼り付けてください。"]
[4,null,null,null,null,null,"---",null,"---",null,"---",null,"---",null,"---",null,"---",null,"---",4,"対象者を100人以上登録したいときは、A100～R101を選択してコピー（又はオートフィル）してください。"]
[5,null,null,null,null,null,"---",null,"---",null,"---",null,"---",null,"---",null,"---",null,"---"]
[6,null,null,null,null,null,"---",null,"---",null,"---",null,"---",null,"---",null,"---",null,"---"]
[7,null,null,null,null,null,"---",null,"---",null,"---",null,"---",null,"---",null,"---",null,"---"]
[8,null,null,null,null,null,"---",null,"---",null,"---",null,"---",null,"---",null,"---",null,"---"]
[9,null,null,null,null,null,"---",null,"---",null,"---",null,"---",null,"---",null,"---",null,"---"]
[10,null,null,null,null,null,"---",null,"---",null,"---",null,"---",null,"---",null,"---",null,"---"]
[11,null,null,null,null,null,"---",null,"---",null,"---",null,"---",null,"---",null,"---",null,"---"]
[12,null,null,null,null,null,"---",null,"---",null,"---",null,"---",null,"---",null,"---",null,"---"]
[13,null,null,null,null,null,"---",null,"---",null,"---",null,"---",null,"---",null,"---",null,"---"]
[14,null,null,null,null,null,"---",null,"---",null,"---",null,"---",null,"---",null,"---",null,"---"]
[15,null,null,null,null,null,"---",null,"---",null,"---",null,"---",null,"---",null,"---",null,"---"]
[16,null,null,null,null,null,"---",null,"---",null,"---",null,"---",null,"---",null,"---",null,"---"]
[17,null,null,null,null,null,"---",null,"---",null,"---",null,"---",null,"---",null,"---",null,"---"]
[18,null,null,null,null,null,"---",null,"---",null,"---",null,"---",null,"---",null,"---",null,"---"]
[19,null,null,null,null,null,"---",null,"---",null,"---",null,"---",null,"---",null,"---",null,"---"]
[20,null,null,null,null,null,"---",null,"---",null,"---",null,"---",null,"---",null,"---",null,"---"]
[21,null,null,null,null,null,"---",null,"---",null,"---",null,"---",null,"---",null,"---",null,"---"]
[22,null,null,null,null,null,"---",null,"---",null,"---",null,"---",null,"---",null,"---",null,"---"]
[23,null,null,null,null,null,"---",null,"---",null,"---",null,"---",null,"---",null,"---",null,"---"]
[24,null,null,null,null,null,"---",null,"---",null,"---",null,"---",null,"---",null,"---",null,"---"]
[25,null,null,null,null,null,"---",null,"---",null,"---",null,"---",null,"---",null,"---",null,"---"]
[26,null,null,null,null,null,"---",null,"---",null,"---",null,"---",null,"---",null,"---",null,"---"]
[27,null,null,null,null,null,"---",null,"---",null,"---",null,"---",null,"---",null,"---",null,"---"]
[28,null,null,null,null,null,"---",null,"---",null,"---",null,"---",null,"---",null,"---",null,"---"]
[29,null,null,null,null,null,"---",null,"---",null,"---",null,"---",null,"---",null,"---",null,"---"]
[30,null,null,null,null,null,"---",null,"---",null,"---",null,"---",null,"---",null,"---",null,"---"]
[31,null,null,null,null,null,"---",null,"---",null,"---",null,"---",null,"---",null,"---",null,"---"]
[32,null,null,null,null,null,"---",null,"---",null,"---",null,"---",null,"---",null,"---",null,"---"]
[33,null,null,null,null,null,"---",null,"---",null,"---",null,"---",null,"---",null,"---",null,"---"]
[34,null,null,null,null,null,"---",null,"---",null,"---",null,"---",null,"---",null,"---",null,"---"]
[35,null,null,null,null,null,"---",null,"---",null,"---",null,"---",null,"---",null,"---",null,"---"]
[36,null,null,null,null,null,"---",null,"---",null,"---",null,"---",null,"---",null,"---",null,"---"]
[37,null,null,null,null,null,"---",null,"---",null,"---",null,"---",null,"---",null,"---",null,"---"]
[38,null,null,null,null,null,"---",null,"---",null,"---",null,"---",null,"---",null,"---",null,"---"]
[39,null,null,null,null,null,"---",null,"---",null,"---",null,"---",null,"---",null,"---",null,"---"]
[40,null,null,null,null,null,"---",null,"---",null,"---",null,"---",null,"---",null,"---",null,"---"]
[41,null,null,null,null,null,"---",null,"---",null,"---",null,"---",null,"---",null,"---",null,"---"]
[42,null,null,null,null,null,"---",null,"---",null,"---",null,"---",null,"---",null,"---",null,"---"]
[43,null,null,null,null,null,"---",null,"---",null,"---",null,"---",null,"---",null,"---",null,"---"]
[44,null,null,null,null,null,"---",null,"---",null,"---",null,"---",null,"---",null,"---",null,"---"]
[45,null,null,null,null,null,"---",null,"---",null,"---",null,"---",null,"---",null,"---",null,"---"]
[46,null,null,null,null,null,"---",null,"---",null,"---",null,"---",null,"---",null,"---",null,"---"]
[47,null,null,null,null,null,"---",null,"---",null,"---",null,"---",null,"---",null,"---",null,"---"]
[48,null,null,null,null,null,"---",null,"---",null,"---",null,"---",null,"---",null,"---",null,"---"]
[49,null,null,null,null,null,"---",null,"---",null,"---",null,"---",null,"---",null,"---",null,"---"]
[50,null,null,null,null,null,"---",null,"---",null,"---",null,"---",null,"---",null,"---",null,"---"]
[51,null,null,null,null,null,"---",null,"---",null,"---",null,"---",null,"---",null,"---",null,"---"]
[52,null,null,null,null,null,"---",null,"---",null,"---",null,"---",null,"---",null,"---",null,"---"]
[53,null,null,null,null,null,"---",null,"---",null,"---",null,"---",null,"---",null,"---",null,"---"]
[54,null,null,null,null,null,"---",null,"---",null,"---",null,"---",null,"---",null,"---",null,"---"]
[55,null,null,null,null,null,"---",null,"---",null,"---",null,"---",null,"---",null,"---",null,"---"]
[56,null,null,null,null,null,"---",null,"---",null,"---",null,"---",null,"---",null,"---",null,"---"]
[57,null,null,null,null,null,"---",null,"---",null,"---",null,"---",null,"---",null,"---",null,"---"]
[58,null,null,null,null,null,"---",null,"---",null,"---",null,"---",null,"---",null,"---",null,"---"]
[59,null,null,null,null,null,"---",null,"---",null,"---",null,"---",null,"---",null,"---",null,"---"]
[60,null,null,null,null,null,"---",null,"---",null,"---",null,"---",null,"---",null,"---",null,"---"]
[61,null,null,null,null,null,"---",null,"---",null,"---",null,"---",null,"---",null,"---",null,"---"]
[62,null,null,null,null,null,"---",null,"---",null,"---",null,"---",null,"---",null,"---",null,"---"]
[63,null,null,null,null,null,"---",null,"---",null,"---",null,"---",null,"---",null,"---",null,"---"]
[64,null,null,null,null,null,"---",null,"---",null,"---",null,"---",null,"---",null,"---",null,"---"]
[65,null,null,null,null,null,"---",null,"---",null,"---",null,"---",null,"---",null,"---",null,"---"]
[66,null,null,null,null,null,"---",null,"---",null,"---",null,"---",null,"---",null,"---",null,"---"]
[67,null,null,null,null,null,"---",null,"---",null,"---",null,"---",null,"---",null,"---",null,"---"]
[68,null,null,null,null,null,"---",null,"---",null,"---",null,"---",null,"---",null,"---",null,"---"]
[69,null,null,null,null,null,"---",null,"---",null,"---",null,"---",null,"---",null,"---",null,"---"]
[70,null,null,null,null,null,"---",null,"---",null,"---",null,"---",null,"---",null,"---",null,"---"]
[71,null,null,null,null,null,"---",null,"---",null,"---",null,"---",null,"---",null,"---",null,"---"]
[72,null,null,null,null,null,"---",null,"---",null,"---",null,"---",null,"---",null,"---",null,"---"]
[73,null,null,null,null,null,"---",null,"---",null,"---",null,"---",null,"---",null,"---",null,"---"]
[74,null,null,null,null,null,"---",null,"---",null,"---",null,"---",null,"---",null,"---",null,"---"]
[75,null,null,null,null,null,"---",null,"---",null,"---",null,"---",null,"---",null,"---",null,"---"]
[76,null,null,null,null,null,"---",null,"---",null,"---",null,"---",null,"---",null,"---",null,"---"]
[77,null,null,null,null,null,"---",null,"---",null,"---",null,"---",null,"---",null,"---",null,"---"]
[78,null,null,null,null,null,"---",null,"---",null,"---",null,"---",null,"---",null,"---",null,"---"]
[79,null,null,null,null,null,"---",null,"---",null,"---",null,"---",null,"---",null,"---",null,"---"]
[80,null,null,null,null,null,"---",null,"---",null,"---",null,"---",null,"---",null,"---",null,"---"]
[81,null,null,null,null,null,"---",null,"---",null,"---",null,"---",null,"---",null,"---",null,"---"]
[82,null,null,null,null,null,"---",null,"---",null,"---",null,"---",null,"---",null,"---",null,"---"]
[83,null,null,null,null,null,"---",null,"---",null,"---",null,"---",null,"---",null,"---",null,"---"]
[84,null,null,null,null,null,"---",null,"---",null,"---",null,"---",null,"---",null,"---",null,"---"]
[85,null,null,null,null,null,"---",null,"---",null,"---",null,"---",null,"---",null,"---",null,"---"]
[86,null,null,null,null,null,"---",null,"---",null,"---",null,"---",null,"---",null,"---",null,"---"]
[87,null,null,null,null,null,"---",null,"---",null,"---",null,"---",null,"---",null,"---",null,"---"]
[88,null,null,null,null,null,"---",null,"---",null,"---",null,"---",null,"---",null,"---",null,"---"]
[89,null,null,null,null,null,"---",null,"---",null,"---",null,"---",null,"---",null,"---",null,"---"]
[90,null,null,null,null,null,"---",null,"---",null,"---",null,"---",null,"---",null,"---",null,"---"]
[91,null,null,null,null,null,"---",null,"---",null,"---",null,"---",null,"---",null,"---",null,"---"]
[92,null,null,null,null,null,"---",null,"---",null,"---",null,"---",null,"---",null,"---",null,"---"]
[93,null,null,null,null,null,"---",null,"---",null,"---",null,"---",null,"---",null,"---",null,"---"]
[94,null,null,null,null,null,"---",null,"---",null,"---",null,"---",null,"---",null,"---",null,"---"]
[95,null,null,null,null,null,"---",null,"---",null,"---",null,"---",null,"---",null,"---",null,"---"]
[96,null,null,null,null,null,"---",null,"---",null,"---",null,"---",null,"---",null,"---",null,"---"]
[97,null,null,null,null,null,"---",null,"---",null,"---",null,"---",null,"---",null,"---",null,"---"]
[98,null,null,null,null,null,"---",null,"---",null,"---",null,"---",null,"---",null,"---",null,"---"]
[99,null,null,null,null,null,"---",null,"---",null,"---",null,"---",null,"---",null,"---",null,"---"]
[100,null,null,null,null,null,"---",null,"---",null,"---",null,"---",null,"---",null,"---",null,"---"]

{"sheet":"アレルゲン","index":2,"n_rows":5,"n_cols":4,"rows_kept":5,"cut":false,"hidden":true,"merged":[]}
[1,{"$f":"VLOOKUP(D$1,対象者!$A:$S,7,FALSE)","v":{"$error":"#N/A"}},"個人番号",{"$f":"アレルギー献立表!H3","v":0}]
[2,{"$f":"VLOOKUP(D$1,対象者!$A:$S,9,FALSE)","v":{"$error":"#N/A"}}]
[3,{"$f":"VLOOKUP(D$1,対象者!$A:$S,11,FALSE)","v":{"$error":"#N/A"}}]
[4,{"$f":"VLOOKUP(D$1,対象者!$A:$S,13,FALSE)","v":{"$error":"#N/A"}}]
[5,{"$f":"VLOOKUP(D$1,対象者!$A:$S,15,FALSE)","v":{"$error":"#N/A"}}]